{"text_format":"3","workbook":"xlsx","n_sheets":4,"sheets":["SKINS","Print","SAMPLE SHOTGUN","SAMPLE SPLIT TEE"],"not_rendered":{"images":1,"macros":1,"defined_names":9,"comments":1},"read":"whole","date_system":"1900"}

{"sheet":"SKINS","index":0,"n_rows":168,"n_cols":51,"rows_kept":168,"merged":[[0,0,0,1],[0,5,0,6],[0,7,0,8],[0,11,1,20],[0,48,2,48],[0,50,4,50],[1,0,1,1],[1,5,3,6],[1,7,1,8],[2,0,2,1],[3,0,3,1],[140,5,140,23],[141,5,141,23]]}
["# in Skins",null,{"$f":"COUNTIF(B6:B115,\"Y\")","v":61},"Skins $ Pot",{"$f":"IF(C2<C1,C2*C3+$H$2,C1*C3+$H$2)","v":{"v":610,"d":"$610"}},{"$f":"VLOOKUP($AT$4,$F$144:$Z$154,20,FALSE)","v":"Coosaw Creek"},null,"Carry Over",null,"PAID\nSKINS","POSTS","INTERCLUB SKINS",{"$nulls":9},"FWD SKINS","REG SKINS","FWD TOTAL","REG TOTAL","TOTAL PLYRS",{"$nulls":22},"    SPLIT TEE \n   BUTTONS \nCROWFIELD \n      ONLY\n         ====>>",null,"Only use CLEAR macros after you've saved backup of workbook"]
["#  Paid",null,{"$f":"COUNTIF(C6:C115,\"Y\")","v":61},"# of Skins",{"$f":"Z3","v":6},"CAUTION:  Do NOT Change anything on cells with neon green or bright yellow background.  Hole scores and player info is OK to edit in cells B6 thru Y115.",null,{"v":0,"d":"$0"},null,{"$f":"COUNTIFS($B$6:$B$115,\"Y\",$C$6:$C$115,\"Y\")","v":61},{"$f":"COUNTIF(G6:G115,\"Y\")","v":61},{"$nulls":10},{"$f":"COUNTIFS(G6:G115,\"Y\",F6:F115,\"*\"&\">F\"&\"*\")","v":18},{"$f":"K2-V2","v":43},{"$f":"COUNTIF(F6:F115,\"*\"&\">F\"&\"*\")","v":38},{"$f":"Z2-X2","v":70},{"$f":"COUNTA(F6:F115)","v":108},{"$nulls":23},"Y"]
["Skins $ Fee",null,{"v":10,"d":"$10"},"Skins Value (EACH)",{"$f":"IF(E2=0,\"\",IF(ROUND(E1/E2,0)<0,ROUNDDOWN((E1-H2)/E2,0),ROUNDDOWN(E1/E2,0)))","v":{"v":101,"d":"$101"}},null,null,{"$f":"IF($C$2=0,\"\",IFERROR(MIN(_xlfn.UNIQUE(INDIRECT(\"h6:h\"&$J$2+5),FALSE,TRUE)),\"\"))","v":3},{"$f":"IF($C$2=0,\"\",IFERROR(MIN(_xlfn.UNIQUE(INDIRECT(\"I6:I\"&$J$2+5),FALSE,TRUE)),\"\"))","v":""},{"$f":"IF($C$2=0,\"\",IFERROR(MIN(_xlfn.UNIQUE(INDIRECT(\"J6:J\"&$J$2+5),FALSE,TRUE)),\"\"))","v":""},{"$f":"IF($C$2=0,\"\",IFERROR(MIN(_xlfn.UNIQUE(INDIRECT(\"K6:K\"&$J$2+5),FALSE,TRUE)),\"\"))","v":""},{"$f":"IF($C$2=0,\"\",IFERROR(MIN(_xlfn.UNIQUE(INDIRECT(\"L6:L\"&$J$2+5),FALSE,TRUE)),\"\"))","v":3},{"$f":"IF($C$2=0,\"\",IFERROR(MIN(_xlfn.UNIQUE(INDIRECT(\"M6:M\"&$J$2+5),FALSE,TRUE)),\"\"))","v":""},{"$f":"IF($C$2=0,\"\",IFERROR(MIN(_xlfn.UNIQUE(INDIRECT(\"N6:N\"&$J$2+5),FALSE,TRUE)),\"\"))","v":""},{"$f":"IF($C$2=0,\"\",IFERROR(MIN(_xlfn.UNIQUE(INDIRECT(\"O6:O\"&$J$2+5),FALSE,TRUE)),\"\"))","v":""},{"$f":"IF($C$2=0,\"\",IFERROR(MIN(_xlfn.UNIQUE(INDIRECT(\"P6:P\"&$J$2+5),FALSE,TRUE)),\"\"))","v":3},{"$f":"IF($C$2=0,\"\",IFERROR(MIN(_xlfn.UNIQUE(INDIRECT(\"Q6:Q\"&$J$2+5),FALSE,TRUE)),\"\"))","v":3},{"$f":"IF($C$2=0,\"\",IFERROR(MIN(_xlfn.UNIQUE(INDIRECT(\"R6:R\"&$J$2+5),FALSE,TRUE)),\"\"))","v":""},{"$f":"IF($C$2=0,\"\",IFERROR(MIN(_xlfn.UNIQUE(INDIRECT(\"S6:S\"&$J$2+5),FALSE,TRUE)),\"\"))","v":""},{"$f":"IF($C$2=0,\"\",IFERROR(MIN(_xlfn.UNIQUE(INDIRECT(\"T6:T\"&$J$2+5),FALSE,TRUE)),\"\"))","v":""},{"$f":"IF($C$2=0,\"\",IFERROR(MIN(_xlfn.UNIQUE(INDIRECT(\"U6:U\"&$J$2+5),FALSE,TRUE)),\"\"))","v":3},{"$f":"IF($C$2=0,\"\",IFERROR(MIN(_xlfn.UNIQUE(INDIRECT(\"V6:V\"&$J$2+5),FALSE,TRUE)),\"\"))","v":""},{"$f":"IF($C$2=0,\"\",IFERROR(MIN(_xlfn.UNIQUE(INDIRECT(\"W6:W\"&$J$2+5),FALSE,TRUE)),\"\"))","v":3},{"$f":"IF($C$2=0,\"\",IFERROR(MIN(_xlfn.UNIQUE(INDIRECT(\"X6:X\"&$J$2+5),FALSE,TRUE)),\"\"))","v":""},{"$f":"IF($C$2=0,\"\",IFERROR(MIN(_xlfn.UNIQUE(INDIRECT(\"Y6:Y\"&$J$2+5),FALSE,TRUE)),\"\"))","v":""},{"$f":"SUM(Z6:Z114)","v":6},null,{"$f":"$C$1+5","v":66},{"$f":"$K$2+5","v":66}]
["$ to Collect",null,{"$f":"(C1-C2)*C3","v":{"v":0,"d":"$0"}}," Next\nCarryover",{"$f":"IF(E2=0,\"\",E1-(E2*E3))","v":{"v":4,"d":"$4"}},null,null,{"$f":"VLOOKUP($AT$4,$F$144:$X$154,G156,0)","v":4},4,3,4,4,3,4,5,4,4,3,5,4,4,3,5,4,4,"PAR",{"$nulls":19},"CC"]
["#","IN\n\"Y\"","PAID\n\"Y\"","Club","Start Tee","Name","POSTED\n\"Y\"",1,2,3,4,5,6,7,8,9,10,11,12,13,14,15,16,17,18,"SKINS\n WON",null,1,2,3,4,5,6,7,8,9,10,11,12,13,14,15,16,17,18,"$\nWON",null,"SORTSKINS"]
[1,"Y","Y","CC","1A","Bill Cattorini","Y",{"$nulls":18},{"$f":"IF(SUM(AB6:AS6)=0,\"\",SUM(AB6:AS6))","v":""},null,{"$f":"IF(H$3=\"\",\"\",IF(AND($B6=\"Y\",$C6=\"Y\",$G6=\"Y\",H6=H$3),1,\"\"))","v":""},{"$f":"IF(I$3=\"\",\"\",IF(AND($B6=\"Y\",$C6=\"Y\",$G6=\"Y\",I6=I$3),1,\"\"))","v":""},{"$f":"IF(J$3=\"\",\"\",IF(AND($B6=\"Y\",$C6=\"Y\",$G6=\"Y\",J6=J$3),1,\"\"))","v":""},{"$f":"IF(K$3=\"\",\"\",IF(AND($B6=\"Y\",$C6=\"Y\",$G6=\"Y\",K6=K$3),1,\"\"))","v":""},{"$f":"IF(L$3=\"\",\"\",IF(AND($B6=\"Y\",$C6=\"Y\",$G6=\"Y\",L6=L$3),1,\"\"))","v":""},{"$f":"IF(M$3=\"\",\"\",IF(AND($B6=\"Y\",$C6=\"Y\",$G6=\"Y\",M6=M$3),1,\"\"))","v":""},{"$f":"IF(N$3=\"\",\"\",IF(AND($B6=\"Y\",$C6=\"Y\",$G6=\"Y\",N6=N$3),1,\"\"))","v":""},{"$f":"IF(O$3=\"\",\"\",IF(AND($B6=\"Y\",$C6=\"Y\",$G6=\"Y\",O6=O$3),1,\"\"))","v":""},{"$f":"IF(P$3=\"\",\"\",IF(AND($B6=\"Y\",$C6=\"Y\",$G6=\"Y\",P6=P$3),1,\"\"))","v":""},{"$f":"IF(Q$3=\"\",\"\",IF(AND($B6=\"Y\",$C6=\"Y\",$G6=\"Y\",Q6=Q$3),1,\"\"))","v":""},{"$f":"IF(R$3=\"\",\"\",IF(AND($B6=\"Y\",$C6=\"Y\",$G6=\"Y\",R6=R$3),1,\"\"))","v":""},{"$f":"IF(S$3=\"\",\"\",IF(AND($B6=\"Y\",$C6=\"Y\",$G6=\"Y\",S6=S$3),1,\"\"))","v":""},{"$f":"IF(T$3=\"\",\"\",IF(AND($B6=\"Y\",$C6=\"Y\",$G6=\"Y\",T6=T$3),1,\"\"))","v":""},{"$f":"IF(U$3=\"\",\"\",IF(AND($B6=\"Y\",$C6=\"Y\",$G6=\"Y\",U6=U$3),1,\"\"))","v":""},{"$f":"IF(V$3=\"\",\"\",IF(AND($B6=\"Y\",$C6=\"Y\",$G6=\"Y\",V6=V$3),1,\"\"))","v":""},{"$f":"IF(W$3=\"\",\"\",IF(AND($B6=\"Y\",$C6=\"Y\",$G6=\"Y\",W6=W$3),1,\"\"))","v":""},{"$f":"IF(X$3=\"\",\"\",IF(AND($B6=\"Y\",$C6=\"Y\",$G6=\"Y\",X6=X$3),1,\"\"))","v":""},{"$f":"IF(Y$3=\"\",\"\",IF(AND($B6=\"Y\",$C6=\"Y\",$G6=\"Y\",Y6=Y$3),1,\"\"))","v":""},{"$f":"IF(B6<>\"Y\",\"\",IF(Z6=\"\",\"\",Z6*$E$3))","v":""},"    LEGEND (BACKGROUND COLOR)","1A",null,"#1 - 8:30"]
[2,"Y","Y","CC","7A","John Carlile","Y",{"$nulls":12},3,null,2,{"$nulls":3},"",null,"","","","","","","","","","","","","","","","","","","","LIGHT BLUE - IN SKINS, NOT PAID","1B",null,"#10 - 8:30"]
[3,"Y","Y","CC","7A","Scott Simpson","Y",{"$nulls":18},"",null,"","","","","","","","","","","","","","","","","","","","LIGHT GREEN - \"NOT\" IN SKINS or NO DATA","2A",null,"#1 - 8:39"]
[4,"Y","Y","CC","11A","Pete Thompson","Y",{"$nulls":18},"",null,"","","","","","","","","","","","","","","","","","","","WHITE - IN SKINS AND PAID","2B",null,"#10 - 8:39"]
[5,"Y","Y","CM","3A","Bob Countie **","Y",{"$nulls":18},"",null,"","","","","","","","","","","","","","","","","","","","DARK GREEN - IN SKINS/PAID, SCORE NOT POSTED","3A",null,"#1 - 8:48"]
[6,"Y","Y","CM","10B","Bernie Rotundo >F","Y",{"$nulls":18},"",null,"","","","","","","","","","","","","","","","","","","","LIGHT GRAY - IN SKINS/PAID/POSTED - NO BIRDIES","3B",null,"#10 - 8:48"]
[7,"Y","Y","CM","13B","Steve O'Riordan >F **","Y",{"$nulls":18},"",null,"","","","","","","","","","","","","","","","","","","","WHITE - IN SKINS/PAID/POSTED & SCORES POSTED","4A",null,"#1 - 8:57"]
[8,"Y","Y","CM","16B","Alex Hartsell >F","Y",null,null,2,{"$nulls":15},"",null,"","","","","","","","","","","","","","","","","","","","RED (PLAYER INFO AREA) - PAID BUT NOT IN SKINS","4B",null,"#10 - 8:57"]
[9,"Y","Y","CN","4A","Fred Hyde","Y",{"$nulls":5},2,{"$nulls":12},"",null,"","","","","","","","","","","","","","","","","","","",null,"5A",null,"#1 - 9:06"]
[10,"Y","Y","CN","4A","Stan Ward","Y",{"$nulls":18},"",null,"","","","","","","","","","","","","","","","","","","","NOTE","5B",null,"#10 - 9:06"]
[11,"Y","Y","CN","6A","Burt Bierman","Y",{"$nulls":12},3,{"$nulls":5},"",null,"","","","","","","","","","","","","","","","","","","",null,"6A",null,"#1 - 9:15"]
[12,"Y","Y","CN","6A","Paul Chisari","Y",{"$nulls":18},"",null,"","","","","","","","","","","","","","","","","","","",null,"6B",null,"#10 - 9:15"]
[13,"Y","Y","CN","9A","Willie Charles","Y",{"$nulls":14},2,{"$nulls":3},"",null,"","","","","","","","","","","","","","","","","","","",null,"7A",null,"#1 - 9:24"]
[14,"Y","Y","CN","9A","Peter Kelleher","Y",3,{"$nulls":17},1,null,1,"","","","","","","","","","","","","","","","","",{"v":101,"d":"$101"},null,"7B",null,"#10 - 9:24"]
[15,"Y","Y","CN","10B","Gunnar Jansson","Y",{"$nulls":18},"",null,"","","","","","","","","","","","","","","","","","","",null,"8A",null,"#1 - 9:33"]
[16,"Y","Y","CN","10B","Jim Zadora","Y",{"$nulls":18},"",null,"","","","","","","","","","","","","","","","","","","",null,"8B",null,"#10 - 9:33"]
[17,"Y","Y","CN","14A","Chuck Cross","Y",{"$nulls":18},"",null,"","","","","","","","","","","","","","","","","","","",null,"9A",null,"#1 - 9:42"]
[18,"Y","Y","CN","14A","Perry Ramicone","Y",{"$nulls":18},"",null,"","","","","","","","","","","","","","","","","","","",null,"9B",null,"#10 - 9:42"]
[19,"Y","Y","CR","3A","Don Sumner","Y",{"$nulls":11},4,{"$nulls":6},"",null,"","","","","","","","","","","","","","","","","","","",null,"10A",null,"#1 - 9:51"]
[20,"Y","Y","DW","8A","Chris Lee","Y",{"$nulls":18},"",null,"","","","","","","","","","","","","","","","","","","",null,"10B",null,"#10 - 9:51"]
[21,"Y","Y","LO","1B","Herman Johnson >F","Y",{"$nulls":18},"",null,"","","","","","","","","","","","","","","","","","","",null,"11A",null,"#1 - 10:00"]
[22,"Y","Y","LO","1B","Roger Harshbarger >F","Y",{"$nulls":18},"",null,"","","","","","","","","","","","","","","","","","","",null,"11B",null,"#10 - 10:00"]
[23,"Y","Y","LO","5B","Bob Richards","Y",{"$nulls":18},"",null,"","","","","","","","","","","","","","","","","","","",null,"12A",null,"#1 - 10:09"]
[24,"Y","Y","LO","5B","Al Sims","Y",{"$nulls":18},"",null,"","","","","","","","","","","","","","","","","","","",null,"12B",null,"#10 - 10:09"]
[25,"Y","Y","LO","10A","Mike Phillips","Y",{"$nulls":11},4,{"$nulls":5},3,"",null,"","","","","","","","","","","","","","","","","","","",null,"13A",null,"#1 - 10:18"]
[26,"Y","Y","LO","10A","Ron McNally","Y",{"$nulls":10},2,{"$nulls":7},"",null,"","","","","","","","","","","","","","","","","","","",null,"13B",null,"#10 - 10:18"]
[27,"Y","Y","LO","12B","Gerald Friend","Y",null,null,2,{"$nulls":15},"",null,"","","","","","","","","","","","","","","","","","","",null,"14A",null,"#1 - 10:27"]
[28,"Y","Y","LO","12B","Nick Greenberg","Y",{"$nulls":18},"",null,"","","","","","","","","","","","","","","","","","","",null,"14B",null,"#10 - 10:27"]
[29,"Y","Y","PF","7A","Scotty Weathers","Y",{"$nulls":5},2,{"$nulls":12},"",null,"","","","","","","","","","","","","","","","","","","",null,"15A"]
[30,"Y","Y","PF","12A","Tom Patterson","Y",{"$nulls":10},2,{"$nulls":5},3,null,"",null,"","","","","","","","","","","","","","","","","","","",null,"15B"]
[31,"Y","Y","PF","12A","Kent Hall","Y",{"$nulls":5},2,{"$nulls":12},"",null,"","","","","","","","","","","","","","","","","","","",null,"16A"]
[32,"Y","Y","PF","16B","Joe DeFilippo","Y",{"$nulls":10},2,{"$nulls":7},"",null,"","","","","","","","","","","","","","","","","","","",null,"16B"]
[33,"Y","Y","RT","15A","John Hubbard >F","Y",null,null,2,{"$nulls":15},{"$f":"IF(SUM(AB38:AS38)=0,\"\",SUM(AB38:AS38))","v":""},null,{"$f":"IF(H$3=\"\",\"\",IF(AND($B38=\"Y\",$C38=\"Y\",$G38=\"Y\",H38=H$3),1,\"\"))","v":""},{"$f":"IF(I$3=\"\",\"\",IF(AND($B38=\"Y\",$C38=\"Y\",$G38=\"Y\",I38=I$3),1,\"\"))","v":""},{"$f":"IF(J$3=\"\",\"\",IF(AND($B38=\"Y\",$C38=\"Y\",$G38=\"Y\",J38=J$3),1,\"\"))","v":""},{"$f":"IF(K$3=\"\",\"\",IF(AND($B38=\"Y\",$C38=\"Y\",$G38=\"Y\",K38=K$3),1,\"\"))","v":""},{"$f":"IF(L$3=\"\",\"\",IF(AND($B38=\"Y\",$C38=\"Y\",$G38=\"Y\",L38=L$3),1,\"\"))","v":""},{"$f":"IF(M$3=\"\",\"\",IF(AND($B38=\"Y\",$C38=\"Y\",$G38=\"Y\",M38=M$3),1,\"\"))","v":""},{"$f":"IF(N$3=\"\",\"\",IF(AND($B38=\"Y\",$C38=\"Y\",$G38=\"Y\",N38=N$3),1,\"\"))","v":""},{"$f":"IF(O$3=\"\",\"\",IF(AND($B38=\"Y\",$C38=\"Y\",$G38=\"Y\",O38=O$3),1,\"\"))","v":""},{"$f":"IF(P$3=\"\",\"\",IF(AND($B38=\"Y\",$C38=\"Y\",$G38=\"Y\",P38=P$3),1,\"\"))","v":""},{"$f":"IF(Q$3=\"\",\"\",IF(AND($B38=\"Y\",$C38=\"Y\",$G38=\"Y\",Q38=Q$3),1,\"\"))","v":""},{"$f":"IF(R$3=\"\",\"\",IF(AND($B38=\"Y\",$C38=\"Y\",$G38=\"Y\",R38=R$3),1,\"\"))","v":""},{"$f":"IF(S$3=\"\",\"\",IF(AND($B38=\"Y\",$C38=\"Y\",$G38=\"Y\",S38=S$3),1,\"\"))","v":""},{"$f":"IF(T$3=\"\",\"\",IF(AND($B38=\"Y\",$C38=\"Y\",$G38=\"Y\",T38=T$3),1,\"\"))","v":""},{"$f":"IF(U$3=\"\",\"\",IF(AND($B38=\"Y\",$C38=\"Y\",$G38=\"Y\",U38=U$3),1,\"\"))","v":""},{"$f":"IF(V$3=\"\",\"\",IF(AND($B38=\"Y\",$C38=\"Y\",$G38=\"Y\",V38=V$3),1,\"\"))","v":""},{"$f":"IF(W$3=\"\",\"\",IF(AND($B38=\"Y\",$C38=\"Y\",$G38=\"Y\",W38=W$3),1,\"\"))","v":""},{"$f":"IF(X$3=\"\",\"\",IF(AND($B38=\"Y\",$C38=\"Y\",$G38=\"Y\",X38=X$3),1,\"\"))","v":""},{"$f":"IF(Y$3=\"\",\"\",IF(AND($B38=\"Y\",$C38=\"Y\",$G38=\"Y\",Y38=Y$3),1,\"\"))","v":""},{"$f":"IF(B38<>\"Y\",\"\",IF(Z38=\"\",\"\",Z38*$E$3))","v":""},null,"17A"]
[34,"Y","Y","RT","15A","Jim Joyce","Y",{"$nulls":4},3,{"$nulls":13},1,null,"","","","",1,"","","","","","","","","","","","","",{"v":101,"d":"$101"},null,"17B"]
[35,"Y","Y","RT","18A","Jim Delaney >F","Y",{"$nulls":18},"",null,"","","","","","","","","","","","","","","","","","","",null,"18A"]
[36,"Y","Y","SM","10A","Dave Silveri >F","Y",{"$nulls":18},"",null,"","","","","","","","","","","","","","","","","","","",null,"18B"]
[37,"Y","Y","SM","10A","Bob Silveri >F","Y",{"$nulls":18},"",null,"","","","","","","","","","","","","","","","","","",""]
[38,"Y","Y","SM","12A","Will Clamp","Y",{"$nulls":18},"",null,"","","","","","","","","","","","","","","","","","",""]
[39,"Y","Y","SM","12A","Steve Traeger >F","Y",{"$nulls":18},"",null,"","","","","","","","","","","","","","","","","","",""]
[40,"Y","Y","SM","13B","Art Archambault >F","Y",{"$nulls":18},"",null,"","","","","","","","","","","","","","","","","","",""]
[41,"Y","Y","SM","13B","Brian Rawl >F","Y",{"$nulls":18},"",null,"","","","","","","","","","","","","","","","","","",""]
[42,"Y","Y","SM","14A","Don Burckhardt","Y",{"$nulls":15},4,null,3,"",null,"","","","","","","","","","","","","","","","","","",""]
[43,"Y","Y","SM","14A","Bob Cultra","Y",{"$nulls":16},3,null,"",null,"","","","","","","","","","","","","","","","","","",""]
[44,"Y","Y","SM","16A","Lynn Carroll","Y",{"$nulls":18},"",null,"","","","","","","","","","","","","","","","","","",""]
[45,"Y","Y","SM","16A","Chuck Morris","Y",{"$nulls":18},"",null,"","","","","","","","","","","","","","","","","","",""]
[46,"Y","Y","SU","4B","Robert Driggs >F","Y",{"$nulls":18},"",null,"","","","","","","","","","","","","","","","","","",""]
[47,"Y","Y","SU","8A","Randy Henderson >F","Y",{"$nulls":18},"",null,"","","","","","","","","","","","","","","","","","",""]
[48,"Y","Y","SU","8A","John Rohr >F","Y",{"$nulls":18},"",null,"","","","","","","","","","","","","","","","","","",""]
[49,"Y","Y","SU","13A","Danny Taylor **","Y",{"$nulls":18},"",null,"","","","","","","","","","","","","","","","","","",""]
[50,"Y","Y","SU","13A","Archie Miller","Y",{"$nulls":18},"",null,"","","","","","","","","","","","","","","","","","",""]
[51,"Y","Y","SU","17A","Gary Hartmann","Y",{"$nulls":13},3,null,4,null,null,1,null,"","","","","","","","","","","","","",1,"","","","",{"v":101,"d":"$101"}]
[52,"Y","Y","SU","17A","Gerry Purvis","Y",null,null,2,{"$nulls":5},3,{"$nulls":9},1,null,"","","","","","","","",1,"","","","","","","","","",{"v":101,"d":"$101"}]
[53,"Y","Y","SU","18A","Kyle Boczkowski","Y",{"$nulls":18},"",null,"","","","","","","","","","","","","","","","","","",""]
[54,"Y","Y","SU","18A","Barry Connor >F","Y",{"$nulls":18},"",null,"","","","","","","","","","","","","","","","","","",""]
[55,"Y","Y","WE","5A","Tim Hall","Y",{"$nulls":9},3,null,4,{"$nulls":6},1,null,"","","","","","","","","",1,"","","","","","","","",{"v":101,"d":"$101"}]
[56,"Y","Y","WE","5A","Doug Brainerd","Y",{"$nulls":15},3,null,null,1,null,"","","","","","","","","","","","","","","",1,"","",{"v":101,"d":"$101"}]
[57,"Y","Y","WE","8B","Kelly Spence","Y",{"$nulls":18},"",null,"","","","","","","","","","","","","","","","","","",""]
[58,"Y","Y","WE","8B","Mark Murray","Y",{"$nulls":18},"",null,"","","","","","","","","","","","","","","","","","",""]
[59,"Y","Y","WE","11A","Stan Petrohovich","Y",{"$nulls":18},"",null,"","","","","","","","","","","","","","","","","","",""]
[60,"Y","Y","WE","15A","Bernie Calcagni >F","Y",{"$nulls":18},"",null,"","","","","","","","","","","","","","","","","","",""]
[61,"Y","Y","WE","18B","Norm Shwarts >F","Y",{"$nulls":18},"",null,"","","","","","","","","","","","","","","","","","",""]
[62,"N",null,"CR","5B","Tim McManus",{"$nulls":19},"",null,"","","","","","","","","","","","","","","","","","",""]
[63,"N",null,"CR","5B","Rick Kemble",{"$nulls":19},"",null,"","","","","","","","","","","","","","","","","","",""]
[64,null,null,"CC","1A","Jim Petros",{"$nulls":19},"",null,"","","","","","","","","","","","","","","","","","",""]
[65,null,null,"CC","4A","Jay Arnold >F",{"$nulls":19},{"$f":"IF(SUM(AB70:AS70)=0,\"\",SUM(AB70:AS70))","v":""},null,{"$f":"IF(H$3=\"\",\"\",IF(AND($B70=\"Y\",$C70=\"Y\",$G70=\"Y\",H70=H$3),1,\"\"))","v":""},{"$f":"IF(I$3=\"\",\"\",IF(AND($B70=\"Y\",$C70=\"Y\",$G70=\"Y\",I70=I$3),1,\"\"))","v":""},{"$f":"IF(J$3=\"\",\"\",IF(AND($B70=\"Y\",$C70=\"Y\",$G70=\"Y\",J70=J$3),1,\"\"))","v":""},{"$f":"IF(K$3=\"\",\"\",IF(AND($B70=\"Y\",$C70=\"Y\",$G70=\"Y\",K70=K$3),1,\"\"))","v":""},{"$f":"IF(L$3=\"\",\"\",IF(AND($B70=\"Y\",$C70=\"Y\",$G70=\"Y\",L70=L$3),1,\"\"))","v":""},{"$f":"IF(M$3=\"\",\"\",IF(AND($B70=\"Y\",$C70=\"Y\",$G70=\"Y\",M70=M$3),1,\"\"))","v":""},{"$f":"IF(N$3=\"\",\"\",IF(AND($B70=\"Y\",$C70=\"Y\",$G70=\"Y\",N70=N$3),1,\"\"))","v":""},{"$f":"IF(O$3=\"\",\"\",IF(AND($B70=\"Y\",$C70=\"Y\",$G70=\"Y\",O70=O$3),1,\"\"))","v":""},{"$f":"IF(P$3=\"\",\"\",IF(AND($B70=\"Y\",$C70=\"Y\",$G70=\"Y\",P70=P$3),1,\"\"))","v":""},{"$f":"IF(Q$3=\"\",\"\",IF(AND($B70=\"Y\",$C70=\"Y\",$G70=\"Y\",Q70=Q$3),1,\"\"))","v":""},{"$f":"IF(R$3=\"\",\"\",IF(AND($B70=\"Y\",$C70=\"Y\",$G70=\"Y\",R70=R$3),1,\"\"))","v":""},{"$f":"IF(S$3=\"\",\"\",IF(AND($B70=\"Y\",$C70=\"Y\",$G70=\"Y\",S70=S$3),1,\"\"))","v":""},{"$f":"IF(T$3=\"\",\"\",IF(AND($B70=\"Y\",$C70=\"Y\",$G70=\"Y\",T70=T$3),1,\"\"))","v":""},{"$f":"IF(U$3=\"\",\"\",IF(AND($B70=\"Y\",$C70=\"Y\",$G70=\"Y\",U70=U$3),1,\"\"))","v":""},{"$f":"IF(V$3=\"\",\"\",IF(AND($B70=\"Y\",$C70=\"Y\",$G70=\"Y\",V70=V$3),1,\"\"))","v":""},{"$f":"IF(W$3=\"\",\"\",IF(AND($B70=\"Y\",$C70=\"Y\",$G70=\"Y\",W70=W$3),1,\"\"))","v":""},{"$f":"IF(X$3=\"\",\"\",IF(AND($B70=\"Y\",$C70=\"Y\",$G70=\"Y\",X70=X$3),1,\"\"))","v":""},{"$f":"IF(Y$3=\"\",\"\",IF(AND($B70=\"Y\",$C70=\"Y\",$G70=\"Y\",Y70=Y$3),1,\"\"))","v":""},{"$f":"IF(B70<>\"Y\",\"\",IF(Z70=\"\",\"\",Z70*$E$3))","v":""}]
[66,null,null,"CC","4A","Bill Boan >F",{"$nulls":19},"",null,"","","","","","","","","","","","","","","","","","",""]
[67,null,null,"CC","11A","John Stark",{"$nulls":19},"",null,"","","","","","","","","","","","","","","","","","",""]
[68,null,null,"CC","17A","Mark Mattison",{"$nulls":19},"",null,"","","","","","","","","","","","","","","","","","",""]
[69,null,null,"CC","17A","John Gaag >F",{"$nulls":19},"",null,"","","","","","","","","","","","","","","","","","",""]
[70,null,null,"CM","2A","Ted Kornya >F",{"$nulls":19},"",null,"","","","","","","","","","","","","","","","","","",""]
[71,null,null,"CM","2A","Jack DeStefano >F",{"$nulls":19},"",null,"","","","","","","","","","","","","","","","","","",""]
[72,null,null,"CM","3A","Mark Swinson",{"$nulls":19},"",null,"","","","","","","","","","","","","","","","","","",""]
[73,null,null,"CM","7B",{"$nulls":20},"",null,"","","","","","","","","","","","","","","","","","",""]
[74,null,null,"CM","10B","Al Stiles >F",{"$nulls":19},"",null,"","","","","","","","","","","","","","","","","","",""]
[75,null,null,"CM","16B","Larry Lee >F",{"$nulls":19},"",null,"","","","","","","","","","","","","","","","","","",""]
[76,null,null,"CR","2A","Fred Robinson",{"$nulls":19},"",null,"","","","","","","","","","","","","","","","","","",""]
[77,null,null,"CR","2A","Don Wollenbecker",{"$nulls":19},"",null,"","","","","","","","","","","","","","","","","","",""]
[78,null,null,"CR","3A","Greg Ferrao",{"$nulls":19},"",null,"","","","","","","","","","","","","","","","","","",""]
[79,null,null,"CR","8B","Lou Cantelmo >F",{"$nulls":19},"",null,"","","","","","","","","","","","","","","","","","",""]
[80,null,null,"CR","8B","Jim Thompson >F",{"$nulls":19},"",null,"","","","","","","","","","","","","","","","","","",""]
[81,null,null,"CR","13A","Bill Barrett",{"$nulls":19},"",null,"","","","","","","","","","","","","","","","","","",""]
[82,null,null,"CR","13A","Mick Boone >F",{"$nulls":19},"",null,"","","","","","","","","","","","","","","","","","",""]
[83,null,null,"DW","1A","Jack Heidenreich >F",{"$nulls":19},"",null,"","","","","","","","","","","","","","","","","","",""]
[84,null,null,"DW","1A","Mike Eovino >F",{"$nulls":19},"",null,"","","","","","","","","","","","","","","","","","",""]
[85,null,null,"DW","6A","Bob Malaussena",{"$nulls":19},"",null,"","","","","","","","","","","","","","","","","","",""]
[86,null,null,"DW","6A","Mike Zettel",{"$nulls":19},"",null,"","","","","","","","","","","","","","","","","","",""]
[87,null,null,"DW","8A","Rich Dekeukelaere >F",{"$nulls":19},"",null,"","","","","","","","","","","","","","","","","","",""]
[88,null,null,"DW","16A","Kevin Cooper",{"$nulls":19},"",null,"","","","","","","","","","","","","","","","","","",""]
[89,null,null,"DW","16A","Ron Thorne",{"$nulls":19},"",null,"","","","","","","","","","","","","","","","","","",""]
[90,null,null,"DW","18B","Jack Fava",{"$nulls":19},"",null,"","","","","","","","","","","","","","","","","","",""]
[91,null,null,"DW","18B","Ray Bradshaw",{"$nulls":19},"",null,"","","","","","","","","","","","","","","","","","",""]
[92,null,null,"LO","4B","Ralph Urbanic",{"$nulls":19},"",null,"","","","","","","","","","","","","","","","","","",""]
[93,null,null,"LO","4B","Michael Creighton",{"$nulls":19},"",null,"","","","","","","","","","","","","","","","","","",""]
[94,null,null,"PF","1B","Jerry Walton >F",{"$nulls":19},"",null,"","","","","","","","","","","","","","","","","","",""]
[95,null,null,"PF","1B","Jim Lusby >F",{"$nulls":19},"",null,"","","","","","","","","","","","","","","","","","",""]
[96,null,null,"PF","7A","Russ Deuell",{"$nulls":19},"",null,"","","","","","","","","","","","","","","","","","",""]
[97,null,null,"PF","9A","Steve Bernard",{"$nulls":19},{"$f":"IF(SUM(AB102:AS102)=0,\"\",SUM(AB102:AS102))","v":""},null,{"$f":"IF(H$3=\"\",\"\",IF(AND($B102=\"Y\",$C102=\"Y\",$G102=\"Y\",H102=H$3),1,\"\"))","v":""},{"$f":"IF(I$3=\"\",\"\",IF(AND($B102=\"Y\",$C102=\"Y\",$G102=\"Y\",I102=I$3),1,\"\"))","v":""},{"$f":"IF(J$3=\"\",\"\",IF(AND($B102=\"Y\",$C102=\"Y\",$G102=\"Y\",J102=J$3),1,\"\"))","v":""},{"$f":"IF(K$3=\"\",\"\",IF(AND($B102=\"Y\",$C102=\"Y\",$G102=\"Y\",K102=K$3),1,\"\"))","v":""},{"$f":"IF(L$3=\"\",\"\",IF(AND($B102=\"Y\",$C102=\"Y\",$G102=\"Y\",L102=L$3),1,\"\"))","v":""},{"$f":"IF(M$3=\"\",\"\",IF(AND($B102=\"Y\",$C102=\"Y\",$G102=\"Y\",M102=M$3),1,\"\"))","v":""},{"$f":"IF(N$3=\"\",\"\",IF(AND($B102=\"Y\",$C102=\"Y\",$G102=\"Y\",N102=N$3),1,\"\"))","v":""},{"$f":"IF(O$3=\"\",\"\",IF(AND($B102=\"Y\",$C102=\"Y\",$G102=\"Y\",O102=O$3),1,\"\"))","v":""},{"$f":"IF(P$3=\"\",\"\",IF(AND($B102=\"Y\",$C102=\"Y\",$G102=\"Y\",P102=P$3),1,\"\"))","v":""},{"$f":"IF(Q$3=\"\",\"\",IF(AND($B102=\"Y\",$C102=\"Y\",$G102=\"Y\",Q102=Q$3),1,\"\"))","v":""},{"$f":"IF(R$3=\"\",\"\",IF(AND($B102=\"Y\",$C102=\"Y\",$G102=\"Y\",R102=R$3),1,\"\"))","v":""},{"$f":"IF(S$3=\"\",\"\",IF(AND($B102=\"Y\",$C102=\"Y\",$G102=\"Y\",S102=S$3),1,\"\"))","v":""},{"$f":"IF(T$3=\"\",\"\",IF(AND($B102=\"Y\",$C102=\"Y\",$G102=\"Y\",T102=T$3),1,\"\"))","v":""},{"$f":"IF(U$3=\"\",\"\",IF(AND($B102=\"Y\",$C102=\"Y\",$G102=\"Y\",U102=U$3),1,\"\"))","v":""},{"$f":"IF(V$3=\"\",\"\",IF(AND($B102=\"Y\",$C102=\"Y\",$G102=\"Y\",V102=V$3),1,\"\"))","v":""},{"$f":"IF(W$3=\"\",\"\",IF(AND($B102=\"Y\",$C102=\"Y\",$G102=\"Y\",W102=W$3),1,\"\"))","v":""},{"$f":"IF(X$3=\"\",\"\",IF(AND($B102=\"Y\",$C102=\"Y\",$G102=\"Y\",X102=X$3),1,\"\"))","v":""},{"$f":"IF(Y$3=\"\",\"\",IF(AND($B102=\"Y\",$C102=\"Y\",$G102=\"Y\",Y102=Y$3),1,\"\"))","v":""},{"$f":"IF(B102<>\"Y\",\"\",IF(Z102=\"\",\"\",Z102*$E$3))","v":""}]
[98,null,null,"PF","9A","Ray Boutin",{"$nulls":19},"",null,"","","","","","","","","","","","","","","","","","",""]
[99,null,null,"PF","16B","David Williams2 >F",{"$nulls":19},"",null,"","","","","","","","","","","","","","","","","","",""]
[100,null,null,"RT","5A","Steve Fischer",{"$nulls":19},"",null,"","","","","","","","","","","","","","","","","","",""]
[101,null,null,"RT","5A","Greg Martin",{"$nulls":19},"",null,"","","","","","","","","","","","","","","","","","",""]
[102,null,null,"RT","7B",{"$nulls":20},"",null,"","","","","","","","","","","","","","","","","","",""]
[103,null,null,"RT","12B","Roger Schroeder >F",{"$nulls":19},"",null,"","","","","","","","","","","","","","","","","","",""]
[104,null,null,"RT","12B","Ron Heyward",{"$nulls":19},"",null,"","","","","","","","","","","","","","","","","","",""]
[105,null,null,"RT","13B","Louis Milone",{"$nulls":19},"",null,"","","","","","","","","","","","","","","","","","",""]
[106,null,null,"RT","18A","Rick Cumberland >F",{"$nulls":19},"",null,"","","","","","","","","","","","","","","","","","",""]
[107,null,null,"SU","4B","Bob Sideikas >F",{"$nulls":19},"",null,"","","","","","","","","","","","","","","","","","",""]
[108,null,null,"WE","11A","David Hotchkiss",{"$nulls":19},"",null,"","","","","","","","","","","","","","","","","","",""]
[109,null,null,"WE","15A","Rich Mudrick >F",{"$nulls":19},"",null,"","","","","","","","","","","","","","","","","","",""]
[110,null,null,"WE","18B","Paul Cornell",{"$nulls":19},"",null,"","","","","","","","","","","","","","","","","","",""]
{"$rows_empty":25}
[{"$nulls":5},"COURSE PARS TABLE"]
[{"$nulls":5},"** DO NOT CHANGE THIS TABLE UNLESS YOU KNOW EXACTLY WHAT YOU'RE DOING - CALL MIKE PHILLIPS IF NEEDED"]
[{"$nulls":5},"Hole #",1,2,3,4,5,6,7,8,9,10,11,12,13,14,15,16,17,18]
[{"$nulls":4},"Coosaw Creek","CC",4,4,3,4,4,3,4,5,4,4,3,5,4,4,3,5,4,4,"Coosaw Creek"]
[{"$nulls":4},"Chas Muni","CM",4,5,4,3,4,4,5,3,4,5,3,4,4,3,5,4,4,4,"Chas Muni"]
[{"$nulls":4},"Chas National","CN",4,3,4,4,5,4,3,4,5,5,4,5,4,3,4,4,4,3,"Chas National"]
[{"$nulls":4},"Crowfield","CR",4,5,4,3,4,4,5,3,4,4,5,4,3,4,4,3,4,5,"Crowfield"]
[{"$nulls":4},"Dunes West","DW",4,4,4,5,4,3,5,3,4,4,5,3,4,4,5,4,3,4,"Dunes West"]
[{"$nulls":4},"Legend Oaks","LO",4,4,3,5,4,5,4,3,4,4,3,4,4,4,5,4,3,5,"Legend Oaks"]
[{"$nulls":4},"Pine Forest","PF",4,4,5,4,3,4,4,3,5,4,5,4,3,4,4,5,3,4,"Pine Forest"]
[{"$nulls":4},"RiverTowne","RT",4,3,5,4,4,4,4,3,5,4,5,4,4,3,4,5,3,4,"RiverTowne"]
[{"$nulls":4},"Shadowmoss","SM",4,4,3,5,4,5,3,4,3,4,4,4,3,5,4,3,5,4,"Shadowmoss"]
[{"$nulls":4},"Summerville","SU",5,3,4,4,4,3,4,4,5,4,5,5,3,4,3,4,3,4,"Summerville"]
[{"$nulls":4},"Wescott","WE",4,5,4,5,4,3,4,3,4,4,4,4,3,5,4,4,3,5,"Wescott"]
[]
[{"$nulls":5},1,2,3,4,5,6,7,8,9,10,11,12,13,14,15,16,17,18,19]
[]
[]
[{"$nulls":3},{"$f":"TRANSPOSE(SPLIT_TEE)","v":"#1 - 8:30"},"#10 - 8:30","#1 - 8:39","#10 - 8:39","#1 - 8:48","#10 - 8:48","#1 - 8:57","#10 - 8:57","#1 - 9:06","#10 - 9:06","#1 - 9:15","#10 - 9:15","#1 - 9:24","#10 - 9:24","#1 - 9:33","#10 - 9:33","#1 - 9:42","#10 - 9:42","#1 - 9:51","#10 - 9:51","#1 - 10:00","#10 - 10:00","#1 - 10:09","#10 - 10:09","#1 - 10:18","#10 - 10:18","#1 - 10:27","#10 - 10:27"]
[{"$nulls":3},{"$f":"_xlfn.TEXTJOIN(\",\",,SPLIT_TEE)","v":"#1 - 8:30,#10 - 8:30,#1 - 8:39,#10 - 8:39,#1 - 8:48,#10 - 8:48,#1 - 8:57,#10 - 8:57,#1 - 9:06,#10 - 9:06,#1 - 9:15,#10 - 9:15,#1 - 9:24,#10 - 9:24,#1 - 9:33,#10 - 9:33,#1 - 9:42,#10 - 9:42,#1 - 9:51,#10 - 9:51,#1 - 10:00,#10 - 10:00,#1 - 10:09,#10 - 10:09,#1 - 10:18,#10 - 10:18,#1 - 10:27,#10 - 10:27"}]
[{"$nulls":3},"#1 - 8:30,#1 - 8:39,#1 - 8:48,#1 - 8:57,#1 - 9:06,#1 - 9:15,#1 - 9:24,#1 - 9:33,#1 - 9:42,#1 - 9:51,#1 - 10:00,#1 - 10:09,#1 - 10:18,#1 - 10:27,#10 - 8:30,#10 - 8:39,#10 - 8:48,#10 - 8:57,#10 - 9:06,#10 - 9:15,#10 - 9:24,#10 - 9:33,#10 - 9:42,#10 - 9:51,#10 - 10:00,#10 - 10:09,#10 - 10:18,#10 - 10:27"]
[{"$nulls":6},{"$f":"TRANSPOSE((SPLIT_TEE))","v":"#1 - 8:30"},"#10 - 8:30","#1 - 8:39","#10 - 8:39","#1 - 8:48","#10 - 8:48","#1 - 8:57","#10 - 8:57","#1 - 9:06","#10 - 9:06","#1 - 9:15","#10 - 9:15","#1 - 9:24","#10 - 9:24","#1 - 9:33","#10 - 9:33","#1 - 9:42","#10 - 9:42","#1 - 9:51","#10 - 9:51","#1 - 10:00","#10 - 10:00","#1 - 10:09","#10 - 10:09","#1 - 10:18","#10 - 10:18","#1 - 10:27","#10 - 10:27"]
[{"$nulls":4},{"$f":"_xlfn.TEXTJOIN(\",\",,SPLIT_TEE)","v":"#1 - 8:30,#10 - 8:30,#1 - 8:39,#10 - 8:39,#1 - 8:48,#10 - 8:48,#1 - 8:57,#10 - 8:57,#1 - 9:06,#10 - 9:06,#1 - 9:15,#10 - 9:15,#1 - 9:24,#10 - 9:24,#1 - 9:33,#10 - 9:33,#1 - 9:42,#10 - 9:42,#1 - 9:51,#10 - 9:51,#1 - 10:00,#10 - 10:00,#1 - 10:09,#10 - 10:09,#1 - 10:18,#10 - 10:18,#1 - 10:27,#10 - 10:27"}]
[]
[{"$nulls":4},"#1 - 8:30,#10 - 8:30,#1 - 8:39,#10 - 8:39,#1 - 8:48,#10 - 8:48,#1 - 8:57,#10 - 8:57,#1 - 9:06,#10 - 9:06,#1 - 9:15,#10 - 9:15,#1 - 9:24,#10 - 9:24,#1 - 9:33,#10 - 9:33,#1 - 9:42,#10 - 9:42,#1 - 9:51,#10 - 9:51,#1 - 10:00,#10 - 10:00,#1 - 10:09,#10 - 10:09,#1 - 10:18,#10 - 10:18,#1 - 10:27,#10 - 10:27"]
[]
[]
[{"$nulls":4},"Stono Ferry","SF",4,3,4,4,5,3,4,5,4,4,3,4,4,3,5,4,5,4,"Stono Ferry"]

{"sheet":"Print","index":1,"n_rows":107,"n_cols":29,"rows_kept":107,"hidden":true,"merged":[[0,0,0,10],[0,12,0,25],[0,28,4,30],[5,28,10,30]]}
["SKINS PAID PLAYERS (AFTER CHECK-IN) - SORTED BY STARTING HOLE #",{"$nulls":11},"SKINS PAID PLAYERS (AFTER CHECK-IN)  -  DEVIATIONS REVEAL CHANGES",{"$nulls":15},"BEFORE CHECK-IN\n- SORT_SKINS (or SORT_SKINS_CR) button before copying data\n- Copy SKINS!C6:F115 to Clipboard\n- Paste Special - Values into green background B3 cell on this TAB"]
["#","Club","Start Tee","Name","Card\nCheck",null,"#","Club","Start Tee","Name","Card \nCheck",null,"#","SKINS","PAID","Club","Start Tee","Name","STATUS","STATUS",null,"#","Club","Start Tee","Name","Card \nCheck","STATUS"]
[1,{"$f":"IF(AND(SKINS!$B6=\"Y\",SKINS!$C6=\"Y\"),SKINS!D6,\"\")","v":"CC"},{"$f":"IF(AND(SKINS!$B6=\"Y\",SKINS!$C6=\"Y\"),SKINS!E6,\"\")","v":"1A"},{"$f":"IF(AND(SKINS!$B6=\"Y\",SKINS!$C6=\"Y\"),SKINS!F6,\"\")","v":"Bill Cattorini"},null,null,{"$f":"A38","v":36},{"$f":"B38","v":"SM"},{"$f":"C38","v":"10A"},{"$f":"D38","v":"Dave Silveri >F"},null,null,1,null,null,"CC","#1 - 8:30","Scott Simpson",{"$f":"_xlfn.XLOOKUP(R3,$D$3:$D$72,$D$3:$D$72,\"\")","v":"Scott Simpson"},{"$f":"IF(R3=\"\",\"-\",IF(S3=\"\",\"OUT\",\"IN\"))","v":"IN"},null,{"$f":"M73","v":36},{"$f":"IF(P38=\"\",\"\",P38)","v":"CN"},{"$f":"IF(Q38=\"\",\"\",Q38)","v":"#1 - 10:09"},{"$f":"IF(R38=\"\",\"\",R38)","v":"Loren Wolfe"},{"$f":"S38","v":""},{"$f":"IF(Y3=\"\",\"-\",IF(Z3=\"\",\"OUT\",\"IN\"))","v":"OUT"}]
[2,{"$f":"IF(AND(SKINS!$B7=\"Y\",SKINS!$C7=\"Y\"),SKINS!D7,\"\")","v":"CC"},{"$f":"IF(AND(SKINS!$B7=\"Y\",SKINS!$C7=\"Y\"),SKINS!E7,\"\")","v":"7A"},{"$f":"IF(AND(SKINS!$B7=\"Y\",SKINS!$C7=\"Y\"),SKINS!F7,\"\")","v":"John Carlile"},null,null,{"$f":"A39","v":37},{"$f":"B39","v":"SM"},{"$f":"C39","v":"10A"},{"$f":"D39","v":"Bob Silveri >F"},null,null,2,null,null,"CN","#1 - 8:30","Paul Chisari",{"$f":"_xlfn.XLOOKUP(R4,$D$3:$D$72,$D$3:$D$72,\"\")","v":"Paul Chisari"},{"$f":"IF(R4=\"\",\"-\",IF(S4=\"\",\"OUT\",\"IN\"))","v":"IN"},null,37,"SM","#1 - 10:09","Tim Cobaugh",{"$f":"S39","v":""},{"$f":"IF(Y4=\"\",\"-\",IF(Z4=\"\",\"OUT\",\"IN\"))","v":"OUT"}]
[3,{"$f":"IF(AND(SKINS!$B8=\"Y\",SKINS!$C8=\"Y\"),SKINS!D8,\"\")","v":"CC"},{"$f":"IF(AND(SKINS!$B8=\"Y\",SKINS!$C8=\"Y\"),SKINS!E8,\"\")","v":"7A"},{"$f":"IF(AND(SKINS!$B8=\"Y\",SKINS!$C8=\"Y\"),SKINS!F8,\"\")","v":"Scott Simpson"},null,null,38,"SM","12A","Will Clamp",null,null,3,null,null,"DW","#1 - 8:30","Chris Lee","Chris Lee","IN",null,38,"SM","#1 - 10:09","Lynn Carroll","Lynn Carroll","IN"]
[4,{"$f":"IF(AND(SKINS!$B9=\"Y\",SKINS!$C9=\"Y\"),SKINS!D9,\"\")","v":"CC"},{"$f":"IF(AND(SKINS!$B9=\"Y\",SKINS!$C9=\"Y\"),SKINS!E9,\"\")","v":"11A"},{"$f":"IF(AND(SKINS!$B9=\"Y\",SKINS!$C9=\"Y\"),SKINS!F9,\"\")","v":"Pete Thompson"},null,null,39,"SM","12A","Steve Traeger >F",null,null,4,null,null,"SM","#1 - 8:30","Brian Rawl >F","Brian Rawl >F","IN",null,39,"SM","#10 - 10:09","Steve Traeger >F","Steve Traeger >F","IN",null,"AFTER CHECK-IN (BEFORE POSTING SKINS)\n- SORT_SKINS (SORT_SKINS_CR) button before copying data\n- Hit COPY Button (this page) to COPY 'AFTER CHECK-IN' data"]
[5,{"$f":"IF(AND(SKINS!$B10=\"Y\",SKINS!$C10=\"Y\"),SKINS!D10,\"\")","v":"CM"},{"$f":"IF(AND(SKINS!$B10=\"Y\",SKINS!$C10=\"Y\"),SKINS!E10,\"\")","v":"3A"},{"$f":"IF(AND(SKINS!$B10=\"Y\",SKINS!$C10=\"Y\"),SKINS!F10,\"\")","v":"Bob Countie **"},null,null,40,"SM","13B","Art Archambault >F",null,null,5,null,null,"CN","#1 - 8:39","Burt Bierman","Burt Bierman","IN",null,40,"SM","#10 - 10:09","Leon McDonald >F","","OUT"]
[6,{"$f":"IF(AND(SKINS!$B11=\"Y\",SKINS!$C11=\"Y\"),SKINS!D11,\"\")","v":"CM"},{"$f":"IF(AND(SKINS!$B11=\"Y\",SKINS!$C11=\"Y\"),SKINS!E11,\"\")","v":"10B"},{"$f":"IF(AND(SKINS!$B11=\"Y\",SKINS!$C11=\"Y\"),SKINS!F11,\"\")","v":"Bernie Rotundo >F"},null,null,41,"SM","13B","Brian Rawl >F",null,null,6,null,null,"SM","#1 - 8:39","Dave Silveri >F","Dave Silveri >F","IN",null,41,"WE","#10 - 10:09","Norm Shwarts >F","Norm Shwarts >F","IN"]
[7,{"$f":"IF(AND(SKINS!$B12=\"Y\",SKINS!$C12=\"Y\"),SKINS!D12,\"\")","v":"CM"},{"$f":"IF(AND(SKINS!$B12=\"Y\",SKINS!$C12=\"Y\"),SKINS!E12,\"\")","v":"13B"},{"$f":"IF(AND(SKINS!$B12=\"Y\",SKINS!$C12=\"Y\"),SKINS!F12,\"\")","v":"Steve O'Riordan >F **"},null,null,42,"SM","14A","Don Burckhardt",null,null,7,null,null,"CN","#10 - 8:39","Earl Richter","","OUT",null,42,"WE","#10 - 10:09","Mark Murray","Mark Murray","IN"]
[8,{"$f":"IF(AND(SKINS!$B13=\"Y\",SKINS!$C13=\"Y\"),SKINS!D13,\"\")","v":"CM"},{"$f":"IF(AND(SKINS!$B13=\"Y\",SKINS!$C13=\"Y\"),SKINS!E13,\"\")","v":"16B"},{"$f":"IF(AND(SKINS!$B13=\"Y\",SKINS!$C13=\"Y\"),SKINS!F13,\"\")","v":"Alex Hartsell >F"},null,null,43,"SM","14A","Bob Cultra",null,null,8,null,null,"CN","#10 - 8:39","Steve Shoff","","OUT",null,43,"CM","#1 - 10:18","Bernie Rotundo >F","Bernie Rotundo >F","IN"]
[9,{"$f":"IF(AND(SKINS!$B14=\"Y\",SKINS!$C14=\"Y\"),SKINS!D14,\"\")","v":"CN"},{"$f":"IF(AND(SKINS!$B14=\"Y\",SKINS!$C14=\"Y\"),SKINS!E14,\"\")","v":"4A"},{"$f":"IF(AND(SKINS!$B14=\"Y\",SKINS!$C14=\"Y\"),SKINS!F14,\"\")","v":"Fred Hyde"},null,null,44,"SM","16A","Lynn Carroll",null,null,9,null,null,"LO","#1 - 8:48","Ron McNally","Ron McNally","IN",null,44,"RT","#1 - 10:18","Jim Delaney >F","Jim Delaney >F","IN"]
[10,{"$f":"IF(AND(SKINS!$B15=\"Y\",SKINS!$C15=\"Y\"),SKINS!D15,\"\")","v":"CN"},{"$f":"IF(AND(SKINS!$B15=\"Y\",SKINS!$C15=\"Y\"),SKINS!E15,\"\")","v":"4A"},{"$f":"IF(AND(SKINS!$B15=\"Y\",SKINS!$C15=\"Y\"),SKINS!F15,\"\")","v":"Stan Ward"},null,null,45,"SM","16A","Chuck Morris",null,null,10,null,null,"LO","#1 - 8:48","Nick Greenberg","Nick Greenberg","IN",null,45,"CM","#10 - 10:18","Don Orlando >F","","OUT"]
[11,{"$f":"IF(AND(SKINS!$B16=\"Y\",SKINS!$C16=\"Y\"),SKINS!D16,\"\")","v":"CN"},{"$f":"IF(AND(SKINS!$B16=\"Y\",SKINS!$C16=\"Y\"),SKINS!E16,\"\")","v":"6A"},{"$f":"IF(AND(SKINS!$B16=\"Y\",SKINS!$C16=\"Y\"),SKINS!F16,\"\")","v":"Burt Bierman"},null,null,46,"SU","4B","Robert Driggs >F",null,null,11,null,null,"CN","#10 - 8:48","Willie Charles","Willie Charles","IN",null,46,"CR","#10 - 10:18","Rick Kemble","","OUT"]
[12,{"$f":"IF(AND(SKINS!$B17=\"Y\",SKINS!$C17=\"Y\"),SKINS!D17,\"\")","v":"CN"},{"$f":"IF(AND(SKINS!$B17=\"Y\",SKINS!$C17=\"Y\"),SKINS!E17,\"\")","v":"6A"},{"$f":"IF(AND(SKINS!$B17=\"Y\",SKINS!$C17=\"Y\"),SKINS!F17,\"\")","v":"Paul Chisari"},null,null,47,"SU","8A","Randy Henderson >F",null,null,12,null,null,"SM","#10 - 8:48","Ron Gosnell >F","","OUT",null,47,"RT","#10 - 10:18","John Hubbard >F","John Hubbard >F","IN"]
[13,{"$f":"IF(AND(SKINS!$B18=\"Y\",SKINS!$C18=\"Y\"),SKINS!D18,\"\")","v":"CN"},{"$f":"IF(AND(SKINS!$B18=\"Y\",SKINS!$C18=\"Y\"),SKINS!E18,\"\")","v":"9A"},{"$f":"IF(AND(SKINS!$B18=\"Y\",SKINS!$C18=\"Y\"),SKINS!F18,\"\")","v":"Willie Charles"},null,null,48,"SU","8A","John Rohr >F",null,null,13,null,null,"CC","#1 - 8:57","Pete Thompson","Pete Thompson","IN",null,48,"SU","#10 - 10:18","John Rohr >F","John Rohr >F","IN"]
[14,{"$f":"IF(AND(SKINS!$B19=\"Y\",SKINS!$C19=\"Y\"),SKINS!D19,\"\")","v":"CN"},{"$f":"IF(AND(SKINS!$B19=\"Y\",SKINS!$C19=\"Y\"),SKINS!E19,\"\")","v":"9A"},{"$f":"IF(AND(SKINS!$B19=\"Y\",SKINS!$C19=\"Y\"),SKINS!F19,\"\")","v":"Peter Kelleher"},null,null,49,"SU","13A","Danny Taylor **",null,null,14,null,null,"CN","#1 - 8:57","Sonny McKay","","OUT",null,49,"SU","#1 - 10:27","Gary Hartmann","Gary Hartmann","IN"]
[15,{"$f":"IF(AND(SKINS!$B20=\"Y\",SKINS!$C20=\"Y\"),SKINS!D20,\"\")","v":"CN"},{"$f":"IF(AND(SKINS!$B20=\"Y\",SKINS!$C20=\"Y\"),SKINS!E20,\"\")","v":"10B"},{"$f":"IF(AND(SKINS!$B20=\"Y\",SKINS!$C20=\"Y\"),SKINS!F20,\"\")","v":"Gunnar Jansson"},null,null,50,"SU","13A","Archie Miller",null,null,15,null,null,"SU","#1 - 8:57","Allan Sharkey >F","","OUT",null,50,"SU","#1 - 10:27","Gerry Purvis","Gerry Purvis","IN"]
[16,{"$f":"IF(AND(SKINS!$B21=\"Y\",SKINS!$C21=\"Y\"),SKINS!D21,\"\")","v":"CN"},{"$f":"IF(AND(SKINS!$B21=\"Y\",SKINS!$C21=\"Y\"),SKINS!E21,\"\")","v":"10B"},{"$f":"IF(AND(SKINS!$B21=\"Y\",SKINS!$C21=\"Y\"),SKINS!F21,\"\")","v":"Jim Zadora"},null,null,51,"SU","17A","Gary Hartmann",null,null,16,null,null,"WE","#1 - 8:57","Bernie Calcagni >F","Bernie Calcagni >F","IN",null,51,"LO","#10 - 10:27","Mike Phillips","Mike Phillips","IN"]
[17,{"$f":"IF(AND(SKINS!$B22=\"Y\",SKINS!$C22=\"Y\"),SKINS!D22,\"\")","v":"CN"},{"$f":"IF(AND(SKINS!$B22=\"Y\",SKINS!$C22=\"Y\"),SKINS!E22,\"\")","v":"14A"},{"$f":"IF(AND(SKINS!$B22=\"Y\",SKINS!$C22=\"Y\"),SKINS!F22,\"\")","v":"Chuck Cross"},null,null,52,"SU","17A","Gerry Purvis",null,null,17,null,null,"SU","#10 - 9:06","Phil Richardson >F","","OUT",null,52,"PF","#10 - 10:27","Joe DeFilippo","Joe DeFilippo","IN"]
[18,{"$f":"IF(AND(SKINS!$B23=\"Y\",SKINS!$C23=\"Y\"),SKINS!D23,\"\")","v":"CN"},{"$f":"IF(AND(SKINS!$B23=\"Y\",SKINS!$C23=\"Y\"),SKINS!E23,\"\")","v":"14A"},{"$f":"IF(AND(SKINS!$B23=\"Y\",SKINS!$C23=\"Y\"),SKINS!F23,\"\")","v":"Perry Ramicone"},null,null,53,"SU","18A","Kyle Boczkowski",null,null,18,null,null,"SU","#10 - 9:06","Art Rooney >F","","OUT",null,53,"","","","","-"]
[19,{"$f":"IF(AND(SKINS!$B24=\"Y\",SKINS!$C24=\"Y\"),SKINS!D24,\"\")","v":"CR"},{"$f":"IF(AND(SKINS!$B24=\"Y\",SKINS!$C24=\"Y\"),SKINS!E24,\"\")","v":"3A"},{"$f":"IF(AND(SKINS!$B24=\"Y\",SKINS!$C24=\"Y\"),SKINS!F24,\"\")","v":"Don Sumner"},null,null,54,"SU","18A","Barry Connor >F",null,null,19,null,null,"CM","#1 - 9:15","Eddy Stubbs","","OUT",null,54,"","","","","-"]
[20,{"$f":"IF(AND(SKINS!$B25=\"Y\",SKINS!$C25=\"Y\"),SKINS!D25,\"\")","v":"DW"},{"$f":"IF(AND(SKINS!$B25=\"Y\",SKINS!$C25=\"Y\"),SKINS!E25,\"\")","v":"8A"},{"$f":"IF(AND(SKINS!$B25=\"Y\",SKINS!$C25=\"Y\"),SKINS!F25,\"\")","v":"Chris Lee"},null,null,55,"WE","5A","Tim Hall",null,null,20,null,null,"CM","#10 - 9:15","Bubba Livingston","","OUT",null,55,"","","","","-"]
[21,{"$f":"IF(AND(SKINS!$B26=\"Y\",SKINS!$C26=\"Y\"),SKINS!D26,\"\")","v":"LO"},{"$f":"IF(AND(SKINS!$B26=\"Y\",SKINS!$C26=\"Y\"),SKINS!E26,\"\")","v":"1B"},{"$f":"IF(AND(SKINS!$B26=\"Y\",SKINS!$C26=\"Y\"),SKINS!F26,\"\")","v":"Herman Johnson >F"},null,null,56,"WE","5A","Doug Brainerd",null,null,21,null,null,"SM","#1 - 9:24","Don Burckhardt","Don Burckhardt","IN",null,56,"","","","","-"]
[22,{"$f":"IF(AND(SKINS!$B27=\"Y\",SKINS!$C27=\"Y\"),SKINS!D27,\"\")","v":"LO"},{"$f":"IF(AND(SKINS!$B27=\"Y\",SKINS!$C27=\"Y\"),SKINS!E27,\"\")","v":"1B"},{"$f":"IF(AND(SKINS!$B27=\"Y\",SKINS!$C27=\"Y\"),SKINS!F27,\"\")","v":"Roger Harshbarger >F"},null,null,57,"WE","8B","Kelly Spence",null,null,22,null,null,"SM","#1 - 9:24","Bob Cultra","Bob Cultra","IN",null,57,"","","","","-"]
[23,{"$f":"IF(AND(SKINS!$B28=\"Y\",SKINS!$C28=\"Y\"),SKINS!D28,\"\")","v":"LO"},{"$f":"IF(AND(SKINS!$B28=\"Y\",SKINS!$C28=\"Y\"),SKINS!E28,\"\")","v":"5B"},{"$f":"IF(AND(SKINS!$B28=\"Y\",SKINS!$C28=\"Y\"),SKINS!F28,\"\")","v":"Bob Richards"},null,null,58,"WE","8B","Mark Murray",null,null,23,null,null,"WE","#1 - 9:42","Stan Petrohovich","Stan Petrohovich","IN",null,58,"","","","","-"]
[24,{"$f":"IF(AND(SKINS!$B29=\"Y\",SKINS!$C29=\"Y\"),SKINS!D29,\"\")","v":"LO"},{"$f":"IF(AND(SKINS!$B29=\"Y\",SKINS!$C29=\"Y\"),SKINS!E29,\"\")","v":"5B"},{"$f":"IF(AND(SKINS!$B29=\"Y\",SKINS!$C29=\"Y\"),SKINS!F29,\"\")","v":"Al Sims"},null,null,59,"WE","11A","Stan Petrohovich",null,null,24,null,null,"WE","#1 - 9:42","Travis Wiley","","OUT",null,59,"","","","","-"]
[25,{"$f":"IF(AND(SKINS!$B30=\"Y\",SKINS!$C30=\"Y\"),SKINS!D30,\"\")","v":"LO"},{"$f":"IF(AND(SKINS!$B30=\"Y\",SKINS!$C30=\"Y\"),SKINS!E30,\"\")","v":"10A"},{"$f":"IF(AND(SKINS!$B30=\"Y\",SKINS!$C30=\"Y\"),SKINS!F30,\"\")","v":"Mike Phillips"},null,null,60,"WE","15A","Bernie Calcagni >F",null,null,25,null,null,"PF","#1 - 9:51","Chris Lloyd","","OUT",null,60,"","","","","-"]
[26,{"$f":"IF(AND(SKINS!$B31=\"Y\",SKINS!$C31=\"Y\"),SKINS!D31,\"\")","v":"LO"},{"$f":"IF(AND(SKINS!$B31=\"Y\",SKINS!$C31=\"Y\"),SKINS!E31,\"\")","v":"10A"},{"$f":"IF(AND(SKINS!$B31=\"Y\",SKINS!$C31=\"Y\"),SKINS!F31,\"\")","v":"Ron McNally"},null,null,61,"WE","18B","Norm Shwarts >F",null,null,26,null,null,"WE","#1 - 9:51","Doug Brainerd","Doug Brainerd","IN",null,61,"","","","","-"]
[27,{"$f":"IF(AND(SKINS!$B32=\"Y\",SKINS!$C32=\"Y\"),SKINS!D32,\"\")","v":"LO"},{"$f":"IF(AND(SKINS!$B32=\"Y\",SKINS!$C32=\"Y\"),SKINS!E32,\"\")","v":"12B"},{"$f":"IF(AND(SKINS!$B32=\"Y\",SKINS!$C32=\"Y\"),SKINS!F32,\"\")","v":"Gerald Friend"},null,null,62,"","","",null,null,27,null,null,"LO","#10 - 9:51","C.H. Coleman","","OUT",null,62,"","","","","-"]
[28,{"$f":"IF(AND(SKINS!$B33=\"Y\",SKINS!$C33=\"Y\"),SKINS!D33,\"\")","v":"LO"},{"$f":"IF(AND(SKINS!$B33=\"Y\",SKINS!$C33=\"Y\"),SKINS!E33,\"\")","v":"12B"},{"$f":"IF(AND(SKINS!$B33=\"Y\",SKINS!$C33=\"Y\"),SKINS!F33,\"\")","v":"Nick Greenberg"},null,null,63,"","","",null,null,28,null,null,"LO","#10 - 9:51","Ken Sharp >F","","OUT",null,63,"","","","","-"]
[29,{"$f":"IF(AND(SKINS!$B34=\"Y\",SKINS!$C34=\"Y\"),SKINS!D34,\"\")","v":"PF"},{"$f":"IF(AND(SKINS!$B34=\"Y\",SKINS!$C34=\"Y\"),SKINS!E34,\"\")","v":"7A"},{"$f":"IF(AND(SKINS!$B34=\"Y\",SKINS!$C34=\"Y\"),SKINS!F34,\"\")","v":"Scotty Weathers"},null,null,64,"","","",null,null,29,null,null,"CN","#1 - 10:00","Fred Moscowich","","OUT",null,64,"","","","","-"]
[30,{"$f":"IF(AND(SKINS!$B35=\"Y\",SKINS!$C35=\"Y\"),SKINS!D35,\"\")","v":"PF"},{"$f":"IF(AND(SKINS!$B35=\"Y\",SKINS!$C35=\"Y\"),SKINS!E35,\"\")","v":"12A"},{"$f":"IF(AND(SKINS!$B35=\"Y\",SKINS!$C35=\"Y\"),SKINS!F35,\"\")","v":"Tom Patterson"},null,null,65,"","","",null,null,30,null,null,"CN","#1 - 10:00","Jim Zadora","Jim Zadora","IN",null,65,"","","","","-"]
[31,{"$f":"IF(AND(SKINS!$B36=\"Y\",SKINS!$C36=\"Y\"),SKINS!D36,\"\")","v":"PF"},{"$f":"IF(AND(SKINS!$B36=\"Y\",SKINS!$C36=\"Y\"),SKINS!E36,\"\")","v":"12A"},{"$f":"IF(AND(SKINS!$B36=\"Y\",SKINS!$C36=\"Y\"),SKINS!F36,\"\")","v":"Kent Hall"},null,null,66,"","","",null,null,31,null,null,"CR","#1 - 10:00","George Dowd >F","","OUT",null,66,"","","","","-"]
[32,{"$f":"IF(AND(SKINS!$B37=\"Y\",SKINS!$C37=\"Y\"),SKINS!D37,\"\")","v":"PF"},{"$f":"IF(AND(SKINS!$B37=\"Y\",SKINS!$C37=\"Y\"),SKINS!E37,\"\")","v":"16B"},{"$f":"IF(AND(SKINS!$B37=\"Y\",SKINS!$C37=\"Y\"),SKINS!F37,\"\")","v":"Joe DeFilippo"},null,null,67,"","","",null,null,32,null,null,"LO","#1 - 10:00","Brian Kelley","","OUT",null,67,"","","","","-"]
[33,{"$f":"IF(AND(SKINS!$B38=\"Y\",SKINS!$C38=\"Y\"),SKINS!D38,\"\")","v":"RT"},{"$f":"IF(AND(SKINS!$B38=\"Y\",SKINS!$C38=\"Y\"),SKINS!E38,\"\")","v":"15A"},{"$f":"IF(AND(SKINS!$B38=\"Y\",SKINS!$C38=\"Y\"),SKINS!F38,\"\")","v":"John Hubbard >F"},null,null,68,"","","",null,null,33,null,null,"CM","#10 - 10:00","Bob Nitkewicz >F","","OUT",null,68,"","","","","-"]
[34,{"$f":"IF(AND(SKINS!$B39=\"Y\",SKINS!$C39=\"Y\"),SKINS!D39,\"\")","v":"RT"},{"$f":"IF(AND(SKINS!$B39=\"Y\",SKINS!$C39=\"Y\"),SKINS!E39,\"\")","v":"15A"},{"$f":"IF(AND(SKINS!$B39=\"Y\",SKINS!$C39=\"Y\"),SKINS!F39,\"\")","v":"Jim Joyce"},null,null,69,"","","",null,null,34,null,null,"WE","#10 - 10:00","Kelly Spence","Kelly Spence","IN",null,69,"","","","","-"]
[35,{"$f":"IF(AND(SKINS!$B40=\"Y\",SKINS!$C40=\"Y\"),SKINS!D40,\"\")","v":"RT"},{"$f":"IF(AND(SKINS!$B40=\"Y\",SKINS!$C40=\"Y\"),SKINS!E40,\"\")","v":"18A"},{"$f":"IF(AND(SKINS!$B40=\"Y\",SKINS!$C40=\"Y\"),SKINS!F40,\"\")","v":"Jim Delaney >F"},null,null,70,"","","",null,null,35,null,null,"CN","#1 - 10:09","Peter Kelleher","Peter Kelleher","IN",null,70,"","","","","-"]
[36,{"$f":"IF(AND(SKINS!$B41=\"Y\",SKINS!$C41=\"Y\"),SKINS!D41,\"\")","v":"SM"},{"$f":"IF(AND(SKINS!$B41=\"Y\",SKINS!$C41=\"Y\"),SKINS!E41,\"\")","v":"10A"},{"$f":"IF(AND(SKINS!$B41=\"Y\",SKINS!$C41=\"Y\"),SKINS!F41,\"\")","v":"Dave Silveri >F"},{"$nulls":8},36,null,null,"CN","#1 - 10:09","Loren Wolfe","","OUT"]
[37,{"$f":"IF(AND(SKINS!$B42=\"Y\",SKINS!$C42=\"Y\"),SKINS!D42,\"\")","v":"SM"},{"$f":"IF(AND(SKINS!$B42=\"Y\",SKINS!$C42=\"Y\"),SKINS!E42,\"\")","v":"10A"},{"$f":"IF(AND(SKINS!$B42=\"Y\",SKINS!$C42=\"Y\"),SKINS!F42,\"\")","v":"Bob Silveri >F"},{"$nulls":8},37,null,null,"SM","#1 - 10:09","Tim Cobaugh","","OUT"]
[38,{"$f":"IF(AND(SKINS!$B43=\"Y\",SKINS!$C43=\"Y\"),SKINS!D43,\"\")","v":"SM"},{"$f":"IF(AND(SKINS!$B43=\"Y\",SKINS!$C43=\"Y\"),SKINS!E43,\"\")","v":"12A"},{"$f":"IF(AND(SKINS!$B43=\"Y\",SKINS!$C43=\"Y\"),SKINS!F43,\"\")","v":"Will Clamp"},{"$nulls":8},38,null,null,"SM","#1 - 10:09","Lynn Carroll","Lynn Carroll","IN"]
[39,{"$f":"IF(AND(SKINS!$B44=\"Y\",SKINS!$C44=\"Y\"),SKINS!D44,\"\")","v":"SM"},{"$f":"IF(AND(SKINS!$B44=\"Y\",SKINS!$C44=\"Y\"),SKINS!E44,\"\")","v":"12A"},{"$f":"IF(AND(SKINS!$B44=\"Y\",SKINS!$C44=\"Y\"),SKINS!F44,\"\")","v":"Steve Traeger >F"},{"$nulls":8},39,null,null,"SM","#10 - 10:09","Steve Traeger >F","Steve Traeger >F","IN"]
[40,{"$f":"IF(AND(SKINS!$B45=\"Y\",SKINS!$C45=\"Y\"),SKINS!D45,\"\")","v":"SM"},{"$f":"IF(AND(SKINS!$B45=\"Y\",SKINS!$C45=\"Y\"),SKINS!E45,\"\")","v":"13B"},{"$f":"IF(AND(SKINS!$B45=\"Y\",SKINS!$C45=\"Y\"),SKINS!F45,\"\")","v":"Art Archambault >F"},{"$nulls":8},40,null,null,"SM","#10 - 10:09","Leon McDonald >F","","OUT"]
[41,{"$f":"IF(AND(SKINS!$B46=\"Y\",SKINS!$C46=\"Y\"),SKINS!D46,\"\")","v":"SM"},{"$f":"IF(AND(SKINS!$B46=\"Y\",SKINS!$C46=\"Y\"),SKINS!E46,\"\")","v":"13B"},{"$f":"IF(AND(SKINS!$B46=\"Y\",SKINS!$C46=\"Y\"),SKINS!F46,\"\")","v":"Brian Rawl >F"},{"$nulls":8},41,null,null,"WE","#10 - 10:09","Norm Shwarts >F","Norm Shwarts >F","IN"]
[42,{"$f":"IF(AND(SKINS!$B47=\"Y\",SKINS!$C47=\"Y\"),SKINS!D47,\"\")","v":"SM"},{"$f":"IF(AND(SKINS!$B47=\"Y\",SKINS!$C47=\"Y\"),SKINS!E47,\"\")","v":"14A"},{"$f":"IF(AND(SKINS!$B47=\"Y\",SKINS!$C47=\"Y\"),SKINS!F47,\"\")","v":"Don Burckhardt"},{"$nulls":8},42,null,null,"WE","#10 - 10:09","Mark Murray","Mark Murray","IN"]
[43,{"$f":"IF(AND(SKINS!$B48=\"Y\",SKINS!$C48=\"Y\"),SKINS!D48,\"\")","v":"SM"},{"$f":"IF(AND(SKINS!$B48=\"Y\",SKINS!$C48=\"Y\"),SKINS!E48,\"\")","v":"14A"},{"$f":"IF(AND(SKINS!$B48=\"Y\",SKINS!$C48=\"Y\"),SKINS!F48,\"\")","v":"Bob Cultra"},{"$nulls":8},43,null,null,"CM","#1 - 10:18","Bernie Rotundo >F","Bernie Rotundo >F","IN"]
[44,{"$f":"IF(AND(SKINS!$B49=\"Y\",SKINS!$C49=\"Y\"),SKINS!D49,\"\")","v":"SM"},{"$f":"IF(AND(SKINS!$B49=\"Y\",SKINS!$C49=\"Y\"),SKINS!E49,\"\")","v":"16A"},{"$f":"IF(AND(SKINS!$B49=\"Y\",SKINS!$C49=\"Y\"),SKINS!F49,\"\")","v":"Lynn Carroll"},{"$nulls":8},44,null,null,"RT","#1 - 10:18","Jim Delaney >F","Jim Delaney >F","IN"]
[45,{"$f":"IF(AND(SKINS!$B50=\"Y\",SKINS!$C50=\"Y\"),SKINS!D50,\"\")","v":"SM"},{"$f":"IF(AND(SKINS!$B50=\"Y\",SKINS!$C50=\"Y\"),SKINS!E50,\"\")","v":"16A"},{"$f":"IF(AND(SKINS!$B50=\"Y\",SKINS!$C50=\"Y\"),SKINS!F50,\"\")","v":"Chuck Morris"},{"$nulls":8},45,null,null,"CM","#10 - 10:18","Don Orlando >F","","OUT"]
[46,{"$f":"IF(AND(SKINS!$B51=\"Y\",SKINS!$C51=\"Y\"),SKINS!D51,\"\")","v":"SU"},{"$f":"IF(AND(SKINS!$B51=\"Y\",SKINS!$C51=\"Y\"),SKINS!E51,\"\")","v":"4B"},{"$f":"IF(AND(SKINS!$B51=\"Y\",SKINS!$C51=\"Y\"),SKINS!F51,\"\")","v":"Robert Driggs >F"},{"$nulls":8},46,null,null,"CR","#10 - 10:18","Rick Kemble","","OUT"]
[47,{"$f":"IF(AND(SKINS!$B52=\"Y\",SKINS!$C52=\"Y\"),SKINS!D52,\"\")","v":"SU"},{"$f":"IF(AND(SKINS!$B52=\"Y\",SKINS!$C52=\"Y\"),SKINS!E52,\"\")","v":"8A"},{"$f":"IF(AND(SKINS!$B52=\"Y\",SKINS!$C52=\"Y\"),SKINS!F52,\"\")","v":"Randy Henderson >F"},{"$nulls":8},47,null,null,"RT","#10 - 10:18","John Hubbard >F","John Hubbard >F","IN"]
[48,{"$f":"IF(AND(SKINS!$B53=\"Y\",SKINS!$C53=\"Y\"),SKINS!D53,\"\")","v":"SU"},{"$f":"IF(AND(SKINS!$B53=\"Y\",SKINS!$C53=\"Y\"),SKINS!E53,\"\")","v":"8A"},{"$f":"IF(AND(SKINS!$B53=\"Y\",SKINS!$C53=\"Y\"),SKINS!F53,\"\")","v":"John Rohr >F"},{"$nulls":8},48,null,null,"SU","#10 - 10:18","John Rohr >F","John Rohr >F","IN"]
[49,{"$f":"IF(AND(SKINS!$B54=\"Y\",SKINS!$C54=\"Y\"),SKINS!D54,\"\")","v":"SU"},{"$f":"IF(AND(SKINS!$B54=\"Y\",SKINS!$C54=\"Y\"),SKINS!E54,\"\")","v":"13A"},{"$f":"IF(AND(SKINS!$B54=\"Y\",SKINS!$C54=\"Y\"),SKINS!F54,\"\")","v":"Danny Taylor **"},{"$nulls":8},49,null,null,"SU","#1 - 10:27","Gary Hartmann","Gary Hartmann","IN"]
[50,{"$f":"IF(AND(SKINS!$B55=\"Y\",SKINS!$C55=\"Y\"),SKINS!D55,\"\")","v":"SU"},{"$f":"IF(AND(SKINS!$B55=\"Y\",SKINS!$C55=\"Y\"),SKINS!E55,\"\")","v":"13A"},{"$f":"IF(AND(SKINS!$B55=\"Y\",SKINS!$C55=\"Y\"),SKINS!F55,\"\")","v":"Archie Miller"},{"$nulls":8},50,null,null,"SU","#1 - 10:27","Gerry Purvis","Gerry Purvis","IN"]
[51,{"$f":"IF(AND(SKINS!$B56=\"Y\",SKINS!$C56=\"Y\"),SKINS!D56,\"\")","v":"SU"},{"$f":"IF(AND(SKINS!$B56=\"Y\",SKINS!$C56=\"Y\"),SKINS!E56,\"\")","v":"17A"},{"$f":"IF(AND(SKINS!$B56=\"Y\",SKINS!$C56=\"Y\"),SKINS!F56,\"\")","v":"Gary Hartmann"},{"$nulls":8},51,null,null,"LO","#10 - 10:27","Mike Phillips","Mike Phillips","IN"]
[52,{"$f":"IF(AND(SKINS!$B57=\"Y\",SKINS!$C57=\"Y\"),SKINS!D57,\"\")","v":"SU"},{"$f":"IF(AND(SKINS!$B57=\"Y\",SKINS!$C57=\"Y\"),SKINS!E57,\"\")","v":"17A"},{"$f":"IF(AND(SKINS!$B57=\"Y\",SKINS!$C57=\"Y\"),SKINS!F57,\"\")","v":"Gerry Purvis"},{"$nulls":8},52,null,null,"PF","#10 - 10:27","Joe DeFilippo","Joe DeFilippo","IN"]
[53,{"$f":"IF(AND(SKINS!$B58=\"Y\",SKINS!$C58=\"Y\"),SKINS!D58,\"\")","v":"SU"},{"$f":"IF(AND(SKINS!$B58=\"Y\",SKINS!$C58=\"Y\"),SKINS!E58,\"\")","v":"18A"},{"$f":"IF(AND(SKINS!$B58=\"Y\",SKINS!$C58=\"Y\"),SKINS!F58,\"\")","v":"Kyle Boczkowski"},{"$nulls":8},53,null,null,"","","","","-"]
[54,{"$f":"IF(AND(SKINS!$B59=\"Y\",SKINS!$C59=\"Y\"),SKINS!D59,\"\")","v":"SU"},{"$f":"IF(AND(SKINS!$B59=\"Y\",SKINS!$C59=\"Y\"),SKINS!E59,\"\")","v":"18A"},{"$f":"IF(AND(SKINS!$B59=\"Y\",SKINS!$C59=\"Y\"),SKINS!F59,\"\")","v":"Barry Connor >F"},{"$nulls":8},54,null,null,"","","","","-"]
[55,{"$f":"IF(AND(SKINS!$B60=\"Y\",SKINS!$C60=\"Y\"),SKINS!D60,\"\")","v":"WE"},{"$f":"IF(AND(SKINS!$B60=\"Y\",SKINS!$C60=\"Y\"),SKINS!E60,\"\")","v":"5A"},{"$f":"IF(AND(SKINS!$B60=\"Y\",SKINS!$C60=\"Y\"),SKINS!F60,\"\")","v":"Tim Hall"},{"$nulls":8},55,null,null,"","","","","-"]
[56,{"$f":"IF(AND(SKINS!$B61=\"Y\",SKINS!$C61=\"Y\"),SKINS!D61,\"\")","v":"WE"},{"$f":"IF(AND(SKINS!$B61=\"Y\",SKINS!$C61=\"Y\"),SKINS!E61,\"\")","v":"5A"},{"$f":"IF(AND(SKINS!$B61=\"Y\",SKINS!$C61=\"Y\"),SKINS!F61,\"\")","v":"Doug Brainerd"},{"$nulls":8},56,null,null,"","","","","-"]
[57,{"$f":"IF(AND(SKINS!$B62=\"Y\",SKINS!$C62=\"Y\"),SKINS!D62,\"\")","v":"WE"},{"$f":"IF(AND(SKINS!$B62=\"Y\",SKINS!$C62=\"Y\"),SKINS!E62,\"\")","v":"8B"},{"$f":"IF(AND(SKINS!$B62=\"Y\",SKINS!$C62=\"Y\"),SKINS!F62,\"\")","v":"Kelly Spence"},{"$nulls":8},57,null,null,"","","","","-"]
[58,{"$f":"IF(AND(SKINS!$B63=\"Y\",SKINS!$C63=\"Y\"),SKINS!D63,\"\")","v":"WE"},{"$f":"IF(AND(SKINS!$B63=\"Y\",SKINS!$C63=\"Y\"),SKINS!E63,\"\")","v":"8B"},{"$f":"IF(AND(SKINS!$B63=\"Y\",SKINS!$C63=\"Y\"),SKINS!F63,\"\")","v":"Mark Murray"},{"$nulls":8},58,null,null,"","","","","-"]
[59,{"$f":"IF(AND(SKINS!$B64=\"Y\",SKINS!$C64=\"Y\"),SKINS!D64,\"\")","v":"WE"},{"$f":"IF(AND(SKINS!$B64=\"Y\",SKINS!$C64=\"Y\"),SKINS!E64,\"\")","v":"11A"},{"$f":"IF(AND(SKINS!$B64=\"Y\",SKINS!$C64=\"Y\"),SKINS!F64,\"\")","v":"Stan Petrohovich"},{"$nulls":8},59,null,null,"","","","","-"]
[60,{"$f":"IF(AND(SKINS!$B65=\"Y\",SKINS!$C65=\"Y\"),SKINS!D65,\"\")","v":"WE"},{"$f":"IF(AND(SKINS!$B65=\"Y\",SKINS!$C65=\"Y\"),SKINS!E65,\"\")","v":"15A"},{"$f":"IF(AND(SKINS!$B65=\"Y\",SKINS!$C65=\"Y\"),SKINS!F65,\"\")","v":"Bernie Calcagni >F"},{"$nulls":8},60,null,null,"","","","","-"]
[61,{"$f":"IF(AND(SKINS!$B66=\"Y\",SKINS!$C66=\"Y\"),SKINS!D66,\"\")","v":"WE"},{"$f":"IF(AND(SKINS!$B66=\"Y\",SKINS!$C66=\"Y\"),SKINS!E66,\"\")","v":"18B"},{"$f":"IF(AND(SKINS!$B66=\"Y\",SKINS!$C66=\"Y\"),SKINS!F66,\"\")","v":"Norm Shwarts >F"},{"$nulls":8},61,null,null,"","","","","-"]
[62,{"$f":"IF(AND(SKINS!$B67=\"Y\",SKINS!$C67=\"Y\"),SKINS!D67,\"\")","v":""},{"$f":"IF(AND(SKINS!$B67=\"Y\",SKINS!$C67=\"Y\"),SKINS!E67,\"\")","v":""},{"$f":"IF(AND(SKINS!$B67=\"Y\",SKINS!$C67=\"Y\"),SKINS!F67,\"\")","v":""},{"$nulls":8},62,null,null,"","","","","-"]
[63,{"$f":"IF(AND(SKINS!$B68=\"Y\",SKINS!$C68=\"Y\"),SKINS!D68,\"\")","v":""},{"$f":"IF(AND(SKINS!$B68=\"Y\",SKINS!$C68=\"Y\"),SKINS!E68,\"\")","v":""},{"$f":"IF(AND(SKINS!$B68=\"Y\",SKINS!$C68=\"Y\"),SKINS!F68,\"\")","v":""},{"$nulls":8},63,null,null,"","","","","-"]
[64,{"$f":"IF(AND(SKINS!$B69=\"Y\",SKINS!$C69=\"Y\"),SKINS!D69,\"\")","v":""},{"$f":"IF(AND(SKINS!$B69=\"Y\",SKINS!$C69=\"Y\"),SKINS!E69,\"\")","v":""},{"$f":"IF(AND(SKINS!$B69=\"Y\",SKINS!$C69=\"Y\"),SKINS!F69,\"\")","v":""},{"$nulls":8},64,null,null,"","","","","-"]
[65,{"$f":"IF(AND(SKINS!$B70=\"Y\",SKINS!$C70=\"Y\"),SKINS!D70,\"\")","v":""},{"$f":"IF(AND(SKINS!$B70=\"Y\",SKINS!$C70=\"Y\"),SKINS!E70,\"\")","v":""},{"$f":"IF(AND(SKINS!$B70=\"Y\",SKINS!$C70=\"Y\"),SKINS!F70,\"\")","v":""},{"$nulls":8},65,null,null,"","","","","-"]
[66,{"$f":"IF(AND(SKINS!$B71=\"Y\",SKINS!$C71=\"Y\"),SKINS!D71,\"\")","v":""},{"$f":"IF(AND(SKINS!$B71=\"Y\",SKINS!$C71=\"Y\"),SKINS!E71,\"\")","v":""},{"$f":"IF(AND(SKINS!$B71=\"Y\",SKINS!$C71=\"Y\"),SKINS!F71,\"\")","v":""},{"$nulls":8},66,null,null,"","","",{"$f":"_xlfn.XLOOKUP(R68,$D$3:$D$72,$D$3:$D$72,\"\")","v":""},{"$f":"IF(R68=\"\",\"-\",IF(S68=\"\",\"OUT\",\"IN\"))","v":"-"}]
[67,{"$f":"IF(AND(SKINS!$B72=\"Y\",SKINS!$C72=\"Y\"),SKINS!D72,\"\")","v":""},{"$f":"IF(AND(SKINS!$B72=\"Y\",SKINS!$C72=\"Y\"),SKINS!E72,\"\")","v":""},{"$f":"IF(AND(SKINS!$B72=\"Y\",SKINS!$C72=\"Y\"),SKINS!F72,\"\")","v":""},{"$nulls":8},67,null,null,"","","","","-"]
[68,{"$f":"IF(AND(SKINS!$B73=\"Y\",SKINS!$C73=\"Y\"),SKINS!D73,\"\")","v":""},{"$f":"IF(AND(SKINS!$B73=\"Y\",SKINS!$C73=\"Y\"),SKINS!E73,\"\")","v":""},{"$f":"IF(AND(SKINS!$B73=\"Y\",SKINS!$C73=\"Y\"),SKINS!F73,\"\")","v":""},{"$nulls":8},68,null,null,"","","","","-"]
[69,{"$f":"IF(AND(SKINS!$B74=\"Y\",SKINS!$C74=\"Y\"),SKINS!D74,\"\")","v":""},{"$f":"IF(AND(SKINS!$B74=\"Y\",SKINS!$C74=\"Y\"),SKINS!E74,\"\")","v":""},{"$f":"IF(AND(SKINS!$B74=\"Y\",SKINS!$C74=\"Y\"),SKINS!F74,\"\")","v":""},{"$nulls":8},69,null,null,"","","","","-"]
[70,{"$f":"IF(AND(SKINS!$B75=\"Y\",SKINS!$C75=\"Y\"),SKINS!D75,\"\")","v":""},{"$f":"IF(AND(SKINS!$B75=\"Y\",SKINS!$C75=\"Y\"),SKINS!E75,\"\")","v":""},{"$f":"IF(AND(SKINS!$B75=\"Y\",SKINS!$C75=\"Y\"),SKINS!F75,\"\")","v":""},{"$nulls":8},70,null,null,"","","","","-"]
[{"$f":"IF(AND(SKINS!$B76=\"Y\",SKINS!$C76=\"Y\"),1+A72,\"\")","v":""},{"$f":"IF(AND(SKINS!$B76=\"Y\",SKINS!$C76=\"Y\"),SKINS!D76,\"\")","v":""},{"$f":"IF(AND(SKINS!$B76=\"Y\",SKINS!$C76=\"Y\"),SKINS!E76,\"\")","v":""},{"$f":"IF(AND(SKINS!$B76=\"Y\",SKINS!$C76=\"Y\"),SKINS!F76,\"\")","v":""},{"$nulls":8},36,null,null,"","","","","-"]
[{"$f":"IF(AND(SKINS!$B77=\"Y\",SKINS!$C77=\"Y\"),1+A73,\"\")","v":""},{"$f":"IF(AND(SKINS!$B77=\"Y\",SKINS!$C77=\"Y\"),SKINS!D77,\"\")","v":""},{"$f":"IF(AND(SKINS!$B77=\"Y\",SKINS!$C77=\"Y\"),SKINS!E77,\"\")","v":""},{"$f":"IF(AND(SKINS!$B77=\"Y\",SKINS!$C77=\"Y\"),SKINS!F77,\"\")","v":""},{"$nulls":8},37,null,null,"","",""]
[{"$f":"IF(AND(SKINS!$B78=\"Y\",SKINS!$C78=\"Y\"),1+A74,\"\")","v":""},{"$f":"IF(AND(SKINS!$B78=\"Y\",SKINS!$C78=\"Y\"),SKINS!D78,\"\")","v":""},{"$f":"IF(AND(SKINS!$B78=\"Y\",SKINS!$C78=\"Y\"),SKINS!E78,\"\")","v":""},{"$f":"IF(AND(SKINS!$B78=\"Y\",SKINS!$C78=\"Y\"),SKINS!F78,\"\")","v":""},{"$nulls":8},38]
[{"$f":"IF(AND(SKINS!$B79=\"Y\",SKINS!$C79=\"Y\"),1+A75,\"\")","v":""},{"$f":"IF(AND(SKINS!$B79=\"Y\",SKINS!$C79=\"Y\"),SKINS!D79,\"\")","v":""},{"$f":"IF(AND(SKINS!$B79=\"Y\",SKINS!$C79=\"Y\"),SKINS!E79,\"\")","v":""},{"$f":"IF(AND(SKINS!$B79=\"Y\",SKINS!$C79=\"Y\"),SKINS!F79,\"\")","v":""},{"$nulls":8},39]
[{"$nulls":12},40]
[{"$nulls":12},41]
[{"$nulls":12},42]
[{"$nulls":12},43]
[{"$nulls":12},44]
[{"$nulls":12},45]
[{"$nulls":12},46]
[{"$nulls":12},47]
[{"$nulls":12},48]
[{"$nulls":12},49]
[{"$nulls":12},50]
[{"$nulls":12},51]
[{"$nulls":12},52]
[{"$nulls":12},53]
[{"$nulls":12},54]
[{"$nulls":12},55]
[{"$nulls":12},56]
[{"$nulls":12},57]
[{"$nulls":12},58]
[{"$nulls":12},59]
[{"$nulls":12},60]
[{"$nulls":12},61]
[{"$nulls":12},62]
[{"$nulls":12},63]
[{"$nulls":12},64]
[{"$nulls":12},65]
[{"$nulls":12},66]
[{"$nulls":12},67]
[{"$nulls":12},68]
[{"$nulls":12},69]
[{"$nulls":12},70]

{"sheet":"SAMPLE SHOTGUN","index":2,"n_rows":115,"n_cols":24,"rows_kept":115,"merged":[[0,0,0,4],[0,5,2,11],[1,0,1,4],[2,0,2,4],[3,0,3,4]]}
["This is the structure and type data you'll get from Google Sheets File.   USE this data to practice Skins tab work for Shotgun Start match.",{"$nulls":4},"USE THIS DATA IF YOU CLEAR ALL ON THE EXAMPLE TAB AS YOU CANNOT UNDO A MACRO THAT CLEARS DATA."]
["Cut and Paste \"All\" Values to the Skins worksheet/tab"]
["COPY/PASTE AREA W/Light Orange Background (no scores)"]
["ALWAYS PASTE \"VALUES\" ONLY"]
["Skins?","Paid?","Club","Start Tee","Name"]
["Y","Y","WE","1A","Stan Petrohovich","Y"]
["Y","Y","WE","1A","Travis Wiley","Y",null,4,{"$nulls":3},3,{"$nulls":10},3]
["Y","Y","CN","1B","Fred Moscowich","Y"]
["Y","Y","CN","1B","Jim Zadora","Y"]
["Y","Y","RT","2A","Jim Delaney >F","Y",null,4]
["Y","Y","CM","3A","Bernie Rotundo >F","Y",null,4,{"$nulls":12},4]
["Y","Y","WE","3A","Kelly Spence","Y",{"$nulls":6},4,{"$nulls":9},3]
["Y","Y","CM","3B","Bob Nitkewicz >F","Y",{"$nulls":16},3]
["Y","Y","CM","3B","Don Orlando >F","Y",{"$nulls":17},3]
["Y","Y","CR","3B","Rick Kemble","Y"]
["Y","Y","CR","4A","George Dowd >F","Y",{"$nulls":10},2,{"$nulls":5},3]
["Y","Y","LO","4A","Brian Kelley","Y",{"$nulls":10},2,{"$nulls":5},3]
["Y","Y","CN","5B","Peter Kelleher","Y",{"$nulls":14},4,null,3]
["Y","Y","CN","5B","Loren Wolfe","Y"]
["Y","Y","LO","6A","C.H. Coleman","Y"]
["Y","Y","LO","6A","Ken Sharp >F","Y",{"$nulls":4},3]
["Y","Y","SM","6A","Steve Traeger >F","Y"]
["Y","Y","SM","6A","Leon McDonald >F","Y",{"$nulls":3},2,{"$nulls":12},3,3]
["Y","Y","RT","6B","John Hubbard >F","Y",{"$nulls":14},4,null,3]
["Y","Y","SU","6B","John Rohr >F","Y"]
["Y","Y","SM","7A","Brian Rawl >F","Y",{"$nulls":15},2]
["Y","Y","CN","7B","Paul Chisari","Y",{"$nulls":16},3]
["Y","Y","CN","7B","Burt Bierman","Y"]
["Y","Y","SM","9A","Dave Silveri >F","Y",null,4,{"$nulls":3},3,{"$nulls":9},3,3]
["Y","Y","SM","9A","Ron Gosnell >F","Y",{"$nulls":5},3,4]
["Y","Y","CN","10A","Willie Charles","Y",{"$nulls":14},4]
["Y","Y","CN","10A","Sonny McKay","Y"]
["Y","Y","SU","10A","Allan Sharkey >F","Y"]
["Y","Y","SU","10B","Phil Richardson >F","Y"]
["Y","Y","SU","10B","Art Rooney >F","Y"]
["Y","Y","CC","12B","Scott Simpson","Y"]
["Y","Y","DW","13A","Chris Lee","Y",{"$nulls":6},4]
["Y","Y","LO","13A","Ron McNally","Y"]
["Y","Y","LO","13A","Nick Greenberg","Y",3,{"$nulls":15},3]
["Y","Y","CC","14A","Pete Thompson","Y",null,4,{"$nulls":4},4,{"$nulls":7},4,null,3]
["Y","Y","WE","14A","Bernie Calcagni >F","Y",{"$nulls":5},3]
["Y","Y","CM","15A","Eddy Stubbs","Y"]
["Y","Y","CM","15A","Bubba Livingston","Y"]
["Y","Y","CN","15A","Earl Richter","Y"]
["Y","Y","CN","15A","Steve Shoff","Y",{"$nulls":6},4]
["Y","Y","PF","16A","Chris Lloyd","Y",{"$nulls":6},4,null,3,{"$nulls":7},3]
["Y","Y","WE","16A","Doug Brainerd","Y",null,4]
["Y","Y","SM","17A","Tim Cobaugh","Y",{"$nulls":6},4,null,null,4,null,3]
["Y","Y","SM","17A","Lynn Carroll","Y",{"$nulls":15},3,3]
["Y","Y","SU","17A","Gary Hartmann","Y"]
["Y","Y","SU","17A","Gerry Purvis","Y"]
["Y","Y","WE","17B","Norm Shwarts >F","Y",null,4]
["Y","Y","WE","17B","Mark Murray","Y",{"$nulls":6},4,null,null,4,null,2,{"$nulls":4},3]
["Y","Y","LO","18A","Mike Phillips","Y",{"$nulls":9},4]
["Y","Y","PF","18B","Joe DeFilippo","Y",{"$nulls":6},4,null,3]
["Y","Y","SM","18B","Don Burckhardt","Y",{"$nulls":7},2]
["Y","Y","SM","18B","Bob Cultra","Y",{"$nulls":16},3,3]
["N",null,"CR","3B","Greg Ferrao"]
["N",null,"SU","10A","Jim Harrell"]
["N",null,"SU","12A","Archie Miller"]
["N",null,"SU","12A","Mark Purcell"]
[null,null,"CM","1A","Dave Steffens >F"]
[null,null,"CM","1A","Jack DeStefano >F"]
[null,null,"PF","1B","Steve Bernard"]
[null,null,"PF","1B","Mike Chodnicki"]
[null,null,"DW","2A","Jack Heidenreich >F"]
[null,null,"DW","2A","Mike Eovino >F"]
[null,null,"RT","2A","Rick Cumberland >F"]
[null,null,"CM","3A","Bob Speziale >F"]
[null,null,"WE","3A","Mike Sando"]
[null,null,"CR","4A","Gene Weir >F"]
[null,null,"LO","4A","Aaron Chase"]
[null,null,"CC","5A","Chip Harriman"]
[null,null,"CC","5A","Jay Arnold >F"]
[null,null,"CM","5A","Doug George"]
[null,null,"DW","5B","Scott Gowdy"]
[null,null,"DW","5B","Jim Devall"]
[null,null,"RT","6B","David Sturgess"]
[null,null,"SU","6B","Bob Sideikas >F"]
[null,null,"LO","7A","Ross Bailey >F"]
[null,null,"LO","7A","Kevin Welter >F"]
[null,null,"SM","7A","Robert Pickard >F"]
[null,null,"RT","7B","Bill Stein"]
[null,null,"RT","7B","Joe Stein"]
[null,null,"CC","8A","John Gaag"]
[null,null,"CC","8A","Mark Mattison"]
[null,null,"DW","8A","Jack Fava"]
[null,null,"DW","8A","Albert Dainton"]
[null,null,"PF","9A","David George >F"]
[null,null,"PF","9A","Jerry Walton >F"]
[null,null,"RT","10B","Rick Corcoran"]
[null,null,"RT","10B","Greg Martin"]
[null,null,"CC","11A","Jim Petros"]
[null,null,"CC","11A","Mike Ankenbruck"]
[null,null,"CM","11A","Al Stiles >F"]
[null,null,"PF","12A","Jerry Cobb >F"]
[null,null,"PF","12A","Russ Deuell"]
[null,null,"CC","12B","John Stark"]
[null,null,"CR","12B","David Kessen"]
[null,null,"CR","12B","Tim McManus"]
[null,null,"DW","13A","Ron Thorne"]
[null,null,"CC","14A","Markus Peter"]
[null,null,"WE","14A","Mike Scioli"]
[null,null,"CR","15B","Bill Barrett"]
[null,null,"CR","15B","Mick Boone >F"]
[null,null,"RT","15B","Steve Fischer"]
[null,null,"RT","15B","Timmy Rogers"]
[null,null,"PF","16A","Ray Boutin"]
[null,null,"WE","16A","David Hotchkiss"]
[null,null,"DW","17B","Tom Montesi"]
[null,null,"DW","17B","Ray Bradshaw"]
[null,null,"CR","18A","Fred Robinson"]
[null,null,"CR","18A","Jim Thompson >F"]
[null,null,"LO","18A","Michael Creighton"]
[null,null,"PF","18B","David Williams2 >F"]

{"sheet":"SAMPLE SPLIT TEE","index":3,"n_rows":115,"n_cols":24,"rows_kept":115,"merged":[[0,0,0,4],[0,5,2,11],[1,0,1,4],[2,0,2,4],[3,0,3,4]]}
["This is the structure and type data you'll get from Google Sheets File.  USE this data to practice Skins tab work for Split Tee (Crowfield Only).",{"$nulls":4},"USE THIS DATA IF YOU CLEAR ALL ON THE SKINS TAB AS YOU CANNOT UNDO A MACRO THAT CLEARS DATA."]
["Cut and Paste \"All\" Values to the Skins worksheet/tab"]
["COPY/PASTE AREA W/Light Orange Background (no scores)"]
["ALWAYS PASTE \"VALUES\" ONLY"]
["Skins?","Paid?","Club","Start Tee","Name"]
["Y","Y","CC","#1 - 8:30","Bill Boan >F","Y",{"$nulls":8},3]
["Y","Y","CR","#1 - 8:30","Hugh Belser","Y"]
["Y","Y","CR","#1 - 8:30","Tim McManus","Y"]
["Y","Y","CC","#1 - 8:39","John Carlile","Y",{"$nulls":8},3]
["Y","Y","PF","#10 - 8:39","Chris Lloyd","Y",null,4]
["Y","Y","PF","#10 - 8:39","Scotty Weathers **","Y",{"$nulls":17},4]
["Y","Y","WE","#10 - 8:39","Kelly Spence","Y",{"$nulls":6},4]
["Y","Y","CR","#1 - 8:48","George Dowd >F","Y",{"$nulls":6},4]
["Y","Y","CC","#10 - 8:48","Scott Simpson","Y"]
["Y","Y","CC","#10 - 8:48","Chip Harriman","Y"]
["Y","Y","CR","#1 - 8:57","David Kessen","Y"]
["Y","Y","WE","#10 - 8:57","Stan Petrohovich","Y"]
["Y","Y","SU","#10 - 9:06","Kyle Boczkowski","Y"]
["Y","Y","SU","#10 - 9:06","Barry Connor >F","Y"]
["Y","Y","LO","#1 - 9:15","Al Sims","Y"]
["Y","Y","LO","#1 - 9:15","George Vaughn","Y"]
["Y","Y","CR","#10 - 9:15","Gene Weir >F","Y",{"$nulls":3},2,{"$nulls":3},2]
["Y","Y","SM","#10 - 9:15","Don Burckhardt","Y",null,null,3,{"$nulls":9},2]
["Y","Y","SM","#10 - 9:15","Bob Cultra","Y"]
["Y","Y","LO","#1 - 9:24","Herman Johnson >F","Y"]
["Y","Y","SM","#1 - 9:24","Brian Rawl >F","Y",{"$nulls":8},3,{"$nulls":7},3]
["Y","Y","LO","#10 - 9:24","Bob Richards","Y"]
["Y","Y","LO","#10 - 9:24","John Schneidmuller","Y",{"$nulls":14},3]
["Y","Y","SM","#10 - 9:24","Lynn Carroll","Y"]
["Y","Y","SM","#10 - 9:24","Chuck Morris","Y"]
["Y","Y","SM","#1 - 9:33","Leon McDonald >F","Y"]
["Y","Y","SM","#1 - 9:33","Steve Traeger >F","Y"]
["Y","Y","SU","#1 - 9:33","Phil Richardson >F","Y"]
["Y","Y","SU","#1 - 9:33","Art Rooney >F","Y",3,{"$nulls":5},4,{"$nulls":5},2]
["Y","Y","LO","#10 - 9:33","Mike Phillips","Y",{"$nulls":7},2,{"$nulls":3},3]
["Y","Y","LO","#10 - 9:33","Ron McNally","Y",{"$nulls":4},3]
["Y","Y","SU","#10 - 9:33","Mike Anderson","Y"]
["Y","Y","SU","#10 - 9:33","Archie Miller","Y"]
["Y","Y","CM","#1 - 9:42","Alex Hartsell >F **","Y",{"$nulls":14},3]
["Y","Y","SU","#1 - 9:42","Alan Sharkey >F","Y"]
["Y","Y","SU","#1 - 9:42","Randy Henderson >F","Y",null,4]
["Y","Y","SM","#10 - 9:42","Dave Silveri >F","Y"]
["Y","Y","SM","#10 - 9:42","Marty Carsner >F **","Y"]
["Y","Y","SU","#10 - 9:42","Bob Hampe >F","Y"]
["Y","Y","RT","#1 - 9:51","Jim Delaney >F","Y"]
["Y","Y","CN","#10 - 9:51","Jack Gedney **","Y",{"$nulls":4},3]
["Y","Y","CN","#10 - 9:51","Peter Kelleher","Y",{"$nulls":6},4]
["Y","Y","CN","#1 - 10:00","Loren Wolfe >F","Y"]
["Y","Y","CN","#1 - 10:00","Paul Chisari","Y"]
["Y","Y","CM","#10 - 10:00","Bob Nitkewicz >F","Y",{"$nulls":10},4]
["Y","Y","CN","#1 - 10:09","Earl Richter","Y",{"$nulls":6},4,{"$nulls":3},4,null,2,{"$nulls":3},3]
["Y","Y","CN","#1 - 10:09","Frank Peters","Y"]
["Y","Y","CN","#10 - 10:09","Jim Zadora","Y"]
["Y","Y","CN","#10 - 10:09","Gunnar Jansson","Y",{"$nulls":13},3,{"$nulls":3},4]
["Y","Y","DW","#10 - 10:09","Chris Lee","Y",{"$nulls":8},3]
["Y","Y","RT","#1 - 10:18","Jim Joyce","Y",{"$nulls":7},2]
["Y","Y","CM","#10 - 10:18","Bernie Rotundo >F","Y"]
["Y","Y","CN","#10 - 10:18","Willie Charles","Y"]
["Y","Y","CN","#10 - 10:18","Sonny McKay","Y",{"$nulls":14},3]
["Y","Y","CR","#1 - 10:27","Fred Robinson","Y"]
["Y","Y","CR","#1 - 10:27","Rick Kemble","Y",{"$nulls":6},4,{"$nulls":3},4,{"$nulls":5},3]
["Y","Y","RT","#10 - 10:27","John Hubbard >F","Y",null,4,{"$nulls":8},4,{"$nulls":6},4]
[null,null,"CC","#1 - 8:30","Jay Arnold >F"]
[null,null,"PF","#10 - 8:30","David George >F"]
[null,null,"PF","#10 - 8:30","Jerry Cobb >F"]
[null,null,"WE","#10 - 8:30","Jim Magnotta"]
[null,null,"WE","#10 - 8:30","Paul Cornell"]
[null,null,"CC","#1 - 8:39","Tom Gormley"]
[null,null,"PF","#1 - 8:39","Russ Deuell"]
[null,null,"PF","#1 - 8:39","Mike Chodnicki"]
[null,null,"WE","#10 - 8:39","Bob Lukas"]
[null,null,"CR","#1 - 8:48","Mick Boone >F"]
[null,null,"PF","#1 - 8:48","Steve Bernard"]
[null,null,"PF","#1 - 8:48","Ray Boutin"]
[null,null,"WE","#10 - 8:48","Norm Shwarts >F"]
[null,null,"WE","#10 - 8:48","Rich Mudrick >F"]
[null,null,"CC","#1 - 8:57","Mike Cleveringa"]
[null,null,"CC","#1 - 8:57","Mark Mattison"]
[null,null,"CR","#1 - 8:57","Bill Barrett"]
[null,null,"PF","#10 - 8:57","Jim Lusby >F"]
[null,null,"PF","#10 - 8:57","David Williams2 >F"]
[null,null,"WE","#10 - 8:57","Pete Germani"]
[null,null,"LO","#1 - 9:06","Mike Bates"]
[null,null,"LO","#1 - 9:06","Don Stephan"]
[null,null,"WE","#1 - 9:06","Peter Jones"]
[null,null,"WE","#1 - 9:06","David Hotchkiss"]
[null,null,"CC","#10 - 9:06","Jim Petros"]
[null,null,"CC","#10 - 9:06","Dennis Rosenbeck >F"]
[null,null,"CR","#1 - 9:15","Jim Thompson >F"]
[null,null,"LO","#1 - 9:24","Kevin Welter >F"]
[null,null,"SM","#1 - 9:24","George Burnham >F"]
[null,null,"CM","#1 - 9:42","James Bailey >F"]
[null,null,"SU","#10 - 9:42","Bob Sideikas >F"]
[null,null,"DW","#1 - 9:51","Jack Heidenreich >F"]
[null,null,"DW","#1 - 9:51","Mike Eovino >F"]
[null,null,"RT","#1 - 9:51","Rick Cumberland >F"]
[null,null,"DW","#10 - 9:51","Jack Fava"]
[null,null,"DW","#10 - 9:51","Ray Bradshaw"]
[null,null,"CM","#1 - 10:00","Ted Kornya >F"]
[null,null,"CM","#1 - 10:00","Chuck Zirkle >F"]
[null,null,"CM","#10 - 10:00","Al Stiles >F"]
[null,null,"RT","#10 - 10:00","Steve Fischer"]
[null,null,"RT","#10 - 10:00","Greg Martin"]
[null,null,"DW","#1 - 10:09","Scott Gowdy"]
[null,null,"DW","#1 - 10:09","Jim Devall"]
[null,null,"DW","#10 - 10:09","Kevin Cooper"]
[null,null,"CM","#1 - 10:18","Jack DeStefano >F"]
[null,null,"CM","#1 - 10:18","Dave Steffens >F"]
[null,null,"RT","#1 - 10:18","Rick Corcoran"]
[null,null,"CM","#10 - 10:18","Dick Greene >F **"]
[null,null,"RT","#1 - 10:27","John Waters"]
[null,null,"RT","#1 - 10:27","Timmy Rogers"]
[null,null,"DW","#10 - 10:27","Ron Thorne"]
[null,null,"DW","#10 - 10:27","Bob Malaussena"]
[null,null,"RT","#10 - 10:27","Roger Schroeder >F"]